{"text_format":"1","workbook":"xlsx","n_sheets":18,"sheets":["Startseite","Tabelle C.1_Toxizität","Tabelle C.2_Brennbarkeit_2L","Tabelle C.2_Brennbarkeit_2_3","Füllmengenberechnung","Notbelüftung","Schutz der Kälteanlage_Teil A","Schutz der Kälteanlage_Teil B","Schutz der Kälteanlage_Teil C","Schutz der Kälteanlage_Teil D","DGRL_Behälter","DGRL_Rohrltg.","Zugangsbereiche","Aufstellungsort der Kälteanlage","Kältemitteltabelle","Kältemittelbezeichnung","Kältemittel-Gemische R-400","Kältemittel-Gemische R-500"],"not_rendered":{"charts":0,"images":1,"macros":1,"external_links":0,"defined_names":14,"comments":0,"pivot_tables":0},"unopened":[],"bounds":{"document_bytes":16777216,"sheet_cells":100000,"rows_first":2000,"rows_last":500,"rows_between":2000,"halvings":0,"cell_chars":16384,"cell_head_chars":4096},"cells_cut":0,"cells_raw":0,"read":"whole","date_system":"1900"}

{"sheet":"Startseite","index":0,"n_rows":25,"n_cols":7,"rows_kept":25,"cut":false,"hidden":false,"merged":[[24,0,24,7],[14,0,14,7],[19,0,19,7],[0,0,0,7],[7,0,7,7],[9,0,9,7],[5,0,5,1],[5,2,5,3],[5,4,5,5],[5,6,5,7],[3,0,3,7],[4,0,4,7],[1,6,1,7]]}
["Excel-Tool zur DIN EN 378"]
["Stand 11/2023",null,null,null,null,null,"© Dipl.-Ing. Thorsten Lerch"]
[]
["Diese Datei unterstützt den Anwender bei der DIN EN 378. "]
["Folgende Ausgaben der DIN EN 378 wurden bei der Bearbeitung berücksichtigt."]
["Teil 1 : 2021-06",null,"Teil 2 : 2018-04",null,"Teil 3 : 2020-12",null,"Teil 4 : 2019-12"]
[]
["Der Anwendungsbereich der vorliegenden Normenreihe berührt nicht nur Fragen der Anlagensicherheit, sondern auch verschiedene Aspekte des betrieblichen Arbeitsschutzes und des Baurechts. Dazu gehören etwa Aufstellungsbereiche der Anlagen, Grenzwerte von Kältemitteln oder Schutz von Personen in Kühlräumen. Zu den in diesem Zusammenhang anzuwendenden Rechtsvorschriften gehören beispielsweise Gefahrstoffverordnung, Arbeitsstättenverordnung, Betriebssicherheitsverordnung sowie ggf. die Bauordnungen der Länder. Der Anwender kann durch das Einhalten der Normanforderungen nicht ohne zusätzliche Prüfung davon ausgehen, dass damit die für Kälteanlagen und Wärmepumpen relevanten Vorschriften der vorgenannten Gesetze eingehalten werden."]
[]
["DIN EN 378-1 Anhang C \"Anforderungen an die maximal zulässige Kältemittel-Füllmenge\""]
[]
[]
[]
[]
["DIN EN 378-2 / Pkt. 6.2.6.2 Schutz der Kälteanlage gegen überhöhten Druck außer beim externen Brand"]
[]
[]
[]
[]
["DIN EN 378-3 / Pkt. 5.13.4 Erforderlicher Luftstrom für die mech. Notbelüftung"]
[]
[]
[]
[]
["DGRL / Bestimmung von Behältern und Rohrleitungen"]

{"sheet":"Tabelle C.1_Toxizität","index":1,"n_rows":44,"n_cols":13,"rows_kept":44,"cut":false,"hidden":false,"merged":[[41,1,42,1],[37,0,42,0],[37,5,42,5],[32,6,42,6],[39,3,40,3],[37,1,37,2],[33,4,36,4],[37,3,37,4],[38,1,40,1],[32,3,32,4],[32,5,36,5],[32,1,32,2],[33,1,34,1],[35,1,36,1],[32,0,36,0],[30,0,31,0],[30,1,31,2],[30,3,30,6],[22,1,22,2],[22,3,22,4],[23,1,25,1],[24,3,25,3],[29,0,29,6],[22,0,27,0],[26,1,27,1],[17,6,27,6],[22,5,27,5],[17,1,17,2],[15,0,16,0],[15,1,16,2],[17,0,21,0],[17,3,17,4],[17,5,21,5],[18,1,19,1],[18,4,21,4],[20,1,21,1],[15,3,15,6]]}
["Kältemittel                     R","134a","← Kältemittel auswählen"]
["Sicherheitsklasse",{"$f":"IFERROR(VLOOKUP(B1,Kältemitteltabelle!A1:I170,2),\"0\")","v":"A"}]
["Brennbarkeit",{"$f":"IFERROR((VLOOKUP(B1,Kältemitteltabelle!A3:I170,3)),\"0\")","v":1},{"$f":"IF(OR(B3=\"2L\",B3=2,B3=3),\"!Achtung Tabelle C.2 beachten!\",\"\")","v":""}]
["Fluidgruppe",{"$f":"IFERROR(VLOOKUP(B1,Kältemitteltabelle!A3:I170,4),\"0\")","v":2}]
["praktischer Grenzwert",{"$f":"IFERROR(VLOOKUP(B1,Kältemitteltabelle!A3:I170,5),\"0\")","v":0.25},"kg/m³"]
["ATEL/ODL",{"$f":"IFERROR(VLOOKUP(B1,Kältemitteltabelle!A3:I170,6),\"0\")","v":0.21},"kg/m³"]
["LFL-Wert",{"$f":"IFERROR(VLOOKUP(B1,Kältemitteltabelle!A3:I170,7),\"0\")","v":"NF"},"kg/m³"]
["Molekularemasse",{"$f":"IFERROR(VLOOKUP(B1,Kältemitteltabelle!A3:I170,8),\"0\")","v":102}]
["Selbstzündungstemp.",{"$f":"IFERROR(VLOOKUP(B1,Kältemitteltabelle!A3:I170,9),\"0\")","v":743},"°C",null,null,null,null,null,"Toxizitätsgrenze  - ADEL/ODL vs pL",null,null,{"$f":"MAX(B5,B6)","v":0.25}]
[null,null,null,null,null,null,null,null,"Zugangsbereich",null,null,1]
[null,null,null,null,null,null,null,null,"Aufstellungsort der Kälteanlage",null,null,1]
[null,null,null,null,null,null,null,null,"Weitere Merkmale",null,null,1]
[]
[]
[null,null,null,null,null,null,null,null,null,null,null,null,{"$f":"IF(L14=TRUE,(IF(($N$13=TRUE),26*1.5*$B$7,26*$B$7)),\"\")","v":""}]
["Toxizitätsklasse","Kategorie des Zugangsbereichs",null,"Aufstellungsort-Klassifikation"]
[null,null,null,"I","II","III","IV"]
["A","a",null,"Toxizitätsgrenze × Raumvolumen oder siehe C.3",null,"Keine Begrenzung der Füllmenge (a)","Die auf der Toxizität beruhenden Anforderungen an die Füllmenge sind in Abhängigkeit vom Ort des belüfteten Gehäuses nach dem Aufstellungsort I, II oder III zu beurteilen "]
[null,"b","Obere Geschosse ohne Notausgänge oder Kellergeschosse","Toxizitätsgrenze × Raumvolumen oder siehe C.3","Keine Begrenzung der Füllmenge (a)"]
[null,null,"Andere","Keine Begrenzung der Füllmenge (a)"]
[null,"c","Obere Geschosse ohne Notausgänge oder Kellergeschosse","Toxizitätsgrenze × Raumvolumen oder siehe C.3"]
[null,null,"Andere","Keine Begrenzung der Füllmenge (a)"]
["B","a",null,"Für dauerhaft geschlossene Sorptionsanlagen: Toxizitätsgrenze × Raumvolumen und nicht mehr als 2,5 kg; alle weiteren Anlagen, Toxizitätsgrenze × Raumvolumen",null,"Keine Begrenzung der Füllmenge (a)"]
[null,"b","Obere Geschosse ohne Notausgänge oder Kellergeschosse","Toxizitätsgrenze × Raumvolumen","Füllmenge nicht mehr als 25 kg (a)"]
[null,null,"Personendichte < 1 Person je 10 m2","Füllmenge nicht mehr als 10 kg (a)","Keine Begrenzung der Füllmenge (a)"]
[null,null,"Andere",null,"Füllmenge nicht mehr als 25 kg (a)"]
[null,"c","Personendichte < 1 Person je 10 m2","Füllmenge nicht mehr als 50 kg (a) und Notausgänge sind vorhanden","Keine Begrenzung der Füllmenge (a)"]
[null,null,"Andere","Füllmenge nicht mehr als 10 kg (a)","Füllmenge nicht mehr als 25 kg (a)"]
[]
["a für die Aufstellung im Freien gilt --> EN 378-3:2016+A1:2020\", 4.2, und für Maschinenräume gilt --> EN 378-3:2016+A1:2020\", 4.3."]
["Toxizitätsklasse","Kategorie des Zugangsbereichs",null,"Aufstellungsort-Klassifikation"]
[null,null,null,"I","II","III","IV"]
["A","a",null,{"$f":"IF(AND(B2=\"A\",L10=1,(OR(L11=1,L11=2))),D18,\"--\")","v":"Toxizitätsgrenze × Raumvolumen oder siehe C.3"},null,{"$f":"IF(AND(B2=\"A\",(OR(L10=1,L10=2,L10=3)),L11=3),F18,\"--\")","v":"--"},{"$f":"IF(AND(OR(B2=\"A\",B2=\"B\"),(OR(L10=1,L10=2,L10=3)),L11=4),G18,\"--\")","v":"--"}]
[null,"b","Obere Geschosse ohne Notausgänge oder Kellergeschosse",{"$f":"IF(AND(B2=\"A\",L10=2,L12=1,L11=1),D19,\"--\")","v":"--"},{"$f":"IF(AND(B2=\"A\",OR(L10=2,L10=3,)*(OR(L12=1,L12=2)),L11=2),E19,\"--\")","v":"--"}]
[null,null,"Andere",{"$f":"IF(AND(B2=\"A\",L10=2,L12=2,L11=1),D20,\"--\")","v":"--"}]
[null,"c","Obere Geschosse ohne Notausgänge oder Kellergeschosse",{"$f":"IF(AND(B2=\"A\",L10=3,L12=1,L11=1),D21,\"--\")","v":"--"}]
[null,null,"Andere",{"$f":"IF(AND(B2=\"A\",L10=3,L12=2,L11=1),D22,\"--\")","v":"--"}]
["B","a",null,{"$f":"IF(AND(B2=\"B\",L10=1,(OR(L11=1,L11=2))),D23,\"--\")","v":"--"},null,{"$f":"IF(AND(B2=\"B\",(OR(L10=1,L10=2,L10=3)),L11=3),F23,\"--\")","v":"--"}]
[null,"b","Obere Geschosse ohne Notausgänge oder Kellergeschosse",{"$f":"IF(AND(B2=\"B\",L10=2,L12=1,L11=1),D24,\"--\")","v":"--"},{"$f":"IF(AND(B2=\"B\",L10=2,L12=1,L11=2),E24,\"--\")","v":"--"}]
[null,null,"Personendichte < 1 Person je 10 m2",{"$f":"IF(AND(B2=\"B\",L10=2,L11=1,(OR(L12=3,L12=2))),D25,\"--\")","v":"--"},{"$f":"IF(AND(B2=\"B\",L10=2,L12=3,L11=2),E25,\"--\")","v":"--"}]
[null,null,"Andere",null,{"$f":"IF(AND(B2=\"B\",L10=2,L12=2,L11=2),E26,\"--\")","v":"--"}]
[null,"c","Personendichte < 1 Person je 10 m2",{"$f":"IF(AND(B2=\"B\",L10=3,L12=3,L11=1),D27,\"--\")","v":"--"},{"$f":"IF(AND(B2=\"B\",L10=3,L12=3,L11=2),E27,\"--\")","v":"--"}]
[null,null,"Andere",{"$f":"IF(AND(B2=\"B\",L10=3,L12=2,L11=1),D28,\"--\")","v":"--"},{"$f":"IF(AND(B2=\"B\",L10=3,L12=2,L11=2),E28,\"--\")","v":"--"}]
["(a) für die Aufstellung im Freien gilt --> EN 378-3:2016+A1:2020\", 4.2, und für Maschinenräume gilt --> EN 378-3:2016+A1:2020\", 4.3."]

{"sheet":"Tabelle C.2_Brennbarkeit_2L","index":2,"n_rows":34,"n_cols":26,"rows_kept":34,"cut":false,"hidden":false,"merged":[[33,0,33,6],[12,0,13,0],[12,1,13,2],[14,6,20,6],[14,1,15,1],[16,1,17,1],[14,0,20,0],[30,3,30,4],[28,1,29,1],[18,1,20,1],[15,3,15,4],[14,5,20,5],[22,0,22,6],[14,3,14,4],[16,3,16,4],[18,3,18,4],[30,1,32,1],[24,0,25,0],[24,1,25,2],[26,0,32,0],[26,1,27,1],[26,5,32,5],[26,6,32,6],[27,3,27,4],[26,3,26,4],[28,3,28,4]]}
["Kältemittel                      R",{"$f":"'Tabelle C.1_Toxizität'!B1","v":"134a"}]
["Sicherheitsklasse",{"$f":"IFERROR(VLOOKUP(B1,Kältemitteltabelle!A1:I170,2),\"0\")","v":"A"}]
["Brennbarkeit",{"$f":"IFERROR(VLOOKUP(B1,Kältemitteltabelle!A1:I170,3),\"0\")","v":1},null,null,null,null,{"$f":"IFERROR((FIXED(Q9,R9)& \" \"&\"kg\"),\"0,00\"&\" \"&\"kg\")","v":"0,00 kg"}]
["Fluidgruppe",{"$f":"IFERROR(VLOOKUP(B1,Kältemitteltabelle!A3:I170,4),\"0\")","v":2},null,null,{"$f":"IF(K7=TRUE,4*$B$7*1.5,\"0,00\")&\" \"&\"kg\"","v":"0,00 kg"}]
["praktischer Grenzwert",{"$f":"IFERROR(VLOOKUP(B1,Kältemitteltabelle!A3:I170,5),\"0\")","v":0.25},"kg/m³",null,null,null,{"$f":"IFERROR((FIXED(Q10,R10)& \" \"&\"m²\"),\"0,00\"&\" \"&\"m²\")","v":"0,00 m²"}]
["ATEL/ODL",{"$f":"IFERROR(VLOOKUP(B1,Kältemitteltabelle!A3:I170,6),\"0\")","v":0.21},"kg/m³",null,{"$f":"IF(K8=TRUE,26*$B$7*1.5,\"0,00\")&\" \"&\"kg\"","v":"0,00 kg"},null,null,null,"Weitere Merkmale",null,1,"Bodenmontage",null,1,{"$f":"IF($N$6=1,0.6,\"\")","v":0.6}]
["LFL-Wert",{"$f":"IFERROR(VLOOKUP(B1,Kältemitteltabelle!A3:I170,7),\"0\")","v":"NF"},"kg/m³",null,null,null,null,null,"Decklungsfaktor m1",null,false,"Fenstermontage",null,null,{"$f":"IF($N$6=2,1,\"\")","v":""}]
["Molekularemasse",{"$f":"IFERROR(VLOOKUP(B1,Kältemitteltabelle!A3:I170,8),\"0\")","v":102},null,null,{"$f":"IF(K9=TRUE,130*$B$7*1.5,\"0,00\")&\" \"&\"kg\"","v":"0,00 kg"},null,null,null,"Decklungsfaktor m2",null,false,"Wandmontage",null,null,{"$f":"IF($N$6=3,1.8,\"\")","v":""}]
["Selbstzündungstemp.",{"$f":"IFERROR(VLOOKUP(B1,Kältemitteltabelle!A3:I170,9),\"0\")","v":743},"°C",null,null,null,null,null,"Decklkungsfaktor m3",null,false,"Deckenmontage",null,null,{"$f":"IF($N$6=4,2.2,\"\")","v":""},{"$f":"SUM(O6:O9)","v":0.6},{"$f":"2.5*(B7^(5/4))*P9*(B10^0.5)","v":{"$error":"#VALUE!"}},2,{"$f":"FIXED(Q9,R9)","v":{"$error":"#VALUE!"}}]
["Raumfläche",null,"m² --> Berechnung nach C.2",null,null,null,null,null,null,null,null,null,null,null,null,null,{"$f":"B11^2/((2.5*(B7^(5/4))*P9)^2)","v":{"$error":"#VALUE!"}},2,{"$f":"FIXED(Q10,R10)","v":{"$error":"#VALUE!"}}]
["KM-Füllmenge in der Anlage",null,"kg --> Berechnung nach C.2"]
[]
["Brennbarkeitsklasse","Kategorie des Zugangsbereichs",null,"Aufstellungsort-Klassifikation",null,null,null,null,null,null,null,null,null,null,null,null,null,null,null,null,null,null,null,null,null,"20 % × LFL × Raumvolumen und nicht mehr als m2 × 1,5 oder nach C.3 und nicht mehr als m3 × 1,5"]
[null,null,null,"I","II","III","IV",null,null,null,null,null,null,null,null,null,null,null,null,null,null,null,null,null,null,"20 % × LFL × Raumvolumen und nicht mehr als m2 × 1,5 oder nach C.3 und nicht mehr als m3 × 1,5"]
["2L","a","Menschlicher Komfort","Nach C.2 und nicht mehr als m2 × 1,5 oder nach C.3 und nicht mehr als m3 × 1,5",null,"Keine Begrenzung der Füllmenge (c)","Füllmenge des Kältemittels nicht mehr als m3 × 1,5",null,null,null,null,null,null,null,null,null,null,null,null,null,null,null,null,null,null,"20 % × LFL × Raumvolumen und nicht mehr als 25 kg (c) oder nach C.3 und nicht mehr als m3 × 1,5"]
[null,null,"Andere Anwendung","20 % × LFL × Raumvolumen und nicht mehr als m2 × 1,5 oder nach C.3 und nicht mehr als m3 × 1,5",null,null,null,null,null,null,null,null,null,null,null,null,null,null,null,null,null,null,null,null,null,"20 % × LFL × Raumvolumen und nicht mehr als m2 × 1,5 oder nach C.3 und nicht mehr als m3 × 1,5"]
[null,"b","Menschlicher Komfort","Nach C.2 und nicht mehr als m2 × 1,5 oder nach C.3 und nicht mehr als m3 × 1,5",null,null,null,null,null,null,null,null,null,null,null,null,null,null,null,null,null,null,null,null,null,"20 % × LFL × Raumvolumen und nicht mehr als 25 kg (c) oder nach C.3 und nicht mehr als m3 × 1,5"]
[null,null,"Andere Anwendung","20 % × LFL × Raumvolumen und nicht mehr als m2 × 1,5 oder nach C.3 und nicht mehr als m3 × 1,5","20 % × LFL × Raumvolumen und nicht mehr als 25 kg (c) oder nach C.3 und nicht mehr als m3 × 1,5",null,null,null,null,null,null,null,null,null,null,null,null,null,null,null,null,null,null,null,null,"20 % × LFL × Raumvolumen und nicht mehr als 50 kg (c) oder nach C.3 und nicht mehr als m3 × 1,5"]
[null,"c","Menschlicher Komfort","Nach C.2 und nicht mehr als m2 × 1,5 oder nach C.3 und nicht mehr als m3 × 1,5"]
[null,null,"Andere Anwendung","20 % × LFL × Raumvolumen und nicht mehr als m2 × 1,5 oder nach C.3 und nicht mehr als m3 × 1,5","20 % × LFL × Raumvolumen und nicht mehr als 25 kg (c) oder nach C.3 und nicht mehr als m3 × 1,5"]
[null,null,null,"20 % × LFL × Raumvolumen und nicht mehr als 50 kg (c) oder nach C.3 und nicht mehr als m3 × 1,5","Keine Begrenzung der Füllmenge (c)"]
[]
["a für die Aufstellung im Freien gilt --> EN 378-3:2016+A1:2020\", 4.2, und für Maschinenräume gilt --> EN 378-3:2016+A1:2020\", 4.3."]
[]
["Brennbarkeitsklasse","Kategorie des Zugangsbereichs",null,"Aufstellungsort-Klassifikation"]
[null,null,null,"I","II","III","IV"]
["2L","a","Menschlicher Komfort",{"$f":"IF(AND(B3=\"2L\",'Tabelle C.1_Toxizität'!L10=1,K6=1,(OR('Tabelle C.1_Toxizität'!L11=1,'Tabelle C.1_Toxizität'!L11=2))),D15,\"--\")","v":"--"},null,{"$f":"IF(AND(B3=\"2L\",(OR('Tabelle C.1_Toxizität'!L10=1,'Tabelle C.1_Toxizität'!L10=2,'Tabelle C.1_Toxizität'!L10=3)),(OR(K6=1,K6=2,K6=3)),('Tabelle C.1_Toxizität'!L11=3)),F15,\"--\")","v":"--"},{"$f":"IF(AND(B3=\"2L\",(OR('Tabelle C.1_Toxizität'!L10=1,'Tabelle C.1_Toxizität'!L10=2,'Tabelle C.1_Toxizität'!L10=3)),(OR(K6=1,K6=2,K6=3)),('Tabelle C.1_Toxizität'!L11=4)),G15,\"--\")","v":"--"}]
[null,null,"Andere Anwendung",{"$f":"IF(AND(B3=\"2L\",'Tabelle C.1_Toxizität'!L10=1,K6=2,(OR('Tabelle C.1_Toxizität'!L11=1,'Tabelle C.1_Toxizität'!L11=2))),D16,\"--\")","v":"--"}]
[null,"b","Menschlicher Komfort",{"$f":"IF(AND(B3=\"2L\",'Tabelle C.1_Toxizität'!L10=2,K6=1,(OR('Tabelle C.1_Toxizität'!L11=1,'Tabelle C.1_Toxizität'!L11=2))),D17,\"--\")","v":"--"}]
[null,null,"Andere Anwendung",{"$f":"IF(AND(B3=\"2L\",'Tabelle C.1_Toxizität'!L10=2,K6=2,('Tabelle C.1_Toxizität'!L11=1)),D18,\"--\")","v":"--"},{"$f":"IF(AND(B3=\"2L\",'Tabelle C.1_Toxizität'!L10=2,K6=2,('Tabelle C.1_Toxizität'!L11=2)),E18,\"--\")","v":"--"}]
[null,"c","Menschlicher Komfort",{"$f":"IF(AND(B3=\"2L\",'Tabelle C.1_Toxizität'!L10=3,K6=1,(OR('Tabelle C.1_Toxizität'!L11=1,'Tabelle C.1_Toxizität'!L11=2))),D19,\"--\")","v":"--"}]
[null,null,"Andere Anwendung",{"$f":"IF(AND(B3=\"2L\",'Tabelle C.1_Toxizität'!L10=3,K6=2,('Tabelle C.1_Toxizität'!L11=1)),D20,\"--\")","v":"--"},{"$f":"IF(AND(B3=\"2L\",'Tabelle C.1_Toxizität'!L10=3,K6=2,('Tabelle C.1_Toxizität'!L11=2)),E20,\"--\")","v":"--"}]
[null,null,"< 1 Person je 10 m2",{"$f":"IF(AND(B3=\"2L\",'Tabelle C.1_Toxizität'!L10=3,K6=3,('Tabelle C.1_Toxizität'!L11=1)),D21,\"--\")","v":"--"},{"$f":"IF(AND(B3=\"2L\",'Tabelle C.1_Toxizität'!L10=3,K6=3,('Tabelle C.1_Toxizität'!L11=2)),E21,\"--\")","v":"--"}]
["(c) Für die Aufstellung im Freien gilt EN 378-3:2016+A1:2020\", 4.2, und für Maschinenräume gilt EN 378-3, 2016+A1:2020\", 4.3."]

{"sheet":"Tabelle C.2_Brennbarkeit_2_3","index":3,"n_rows":52,"n_cols":26,"rows_kept":52,"cut":false,"hidden":false,"merged":[[42,7,50,7],[19,4,19,5],[15,4,15,5],[35,4,35,5],[29,4,29,5],[37,4,37,5],[36,4,36,5],[25,4,25,5],[28,4,28,5],[26,4,26,5],[15,7,21,7],[16,4,16,5],[18,4,18,5],[17,4,17,5],[49,4,49,5],[45,6,47,6],[48,6,50,6],[19,2,19,3],[20,4,20,5],[22,4,22,5],[15,6,21,6],[22,6,24,6],[25,6,27,6],[28,6,30,6],[23,4,23,5],[38,4,38,5],[47,4,47,5],[48,4,48,5],[15,2,15,3],[35,6,41,6],[22,2,22,3],[23,2,24,2],[42,1,44,1],[45,1,47,1],[48,1,50,1],[46,4,46,5],[16,2,16,3],[17,2,17,3],[18,2,18,3],[25,1,27,1],[37,1,38,1],[36,2,36,3],[39,2,39,3],[40,2,41,2],[39,4,39,5],[38,2,38,3],[37,2,37,3],[22,1,24,1],[33,0,34,0],[33,1,34,3],[32,0,32,7],[22,7,30,7],[27,4,27,5],[24,4,24,5],[26,2,27,2],[39,1,41,1],[28,2,28,3],[35,1,36,1],[29,2,30,2],[35,2,35,3],[13,0,14,0],[13,1,14,3],[19,1,21,1],[28,1,30,1],[15,0,21,0],[20,2,21,2],[17,1,18,1],[15,1,16,1],[22,0,30,0],[25,2,25,3],[51,0,51,7],[35,7,41,7],[40,4,40,5],[42,4,42,5],[43,4,43,5],[44,4,44,5],[42,6,44,6],[42,2,42,3],[43,2,44,2],[45,2,45,3],[46,2,47,2],[48,2,48,3],[49,2,50,2],[45,4,45,5],[42,0,50,0],[35,0,41,0]]}
["Kältemittel                      R",{"$f":"'Tabelle C.1_Toxizität'!B1","v":"134a"}]
["Sicherheitsklasse",{"$f":"IFERROR(VLOOKUP(B1,Kältemitteltabelle!A1:I170,2),\"0\")","v":"A"}]
["Brennbarkeit",{"$f":"IFERROR(VLOOKUP(B1,Kältemitteltabelle!A1:I170,3),\"0\")","v":1},null,null,null,null,null,{"$f":"IFERROR((FIXED(T9)& \" \"&\"kg\"),\"0,00\"&\" \"&\"kg\")","v":"0,00 kg"}]
["Fluidgruppe",{"$f":"IFERROR(VLOOKUP(B1,Kältemitteltabelle!A3:I170,4),\"0\")","v":2},null,null,null,{"$f":"IF(L6=TRUE,4*$B$7,\"0,00\")&\" \"&\"kg\"","v":"0,00 kg"}]
["praktischer Grenzwert",{"$f":"IFERROR(VLOOKUP(B1,Kältemitteltabelle!A3:I170,5),\"0\")","v":0.25},"kg/m³",null,null,null,null,{"$f":"IFERROR((FIXED(R10,S10)& \" \"&\"m²\"),\"0,00\"&\" \"&\"m²\")","v":"0,00 m²"}]
["ATEL/ODL",{"$f":"IFERROR(VLOOKUP(B1,Kältemitteltabelle!A3:I170,6),\"0\")","v":0.21},"kg/m³",null,null,{"$f":"IF(L7=TRUE,26*$B$7,\"0,00\")&\" \"&\"kg\"","v":"0,00 kg"},null,null,null,"Decklungsfaktor m1",null,false,"Bodenmontage",null,4,{"$f":"IF($O$6=1,0.6,\"\")","v":""}]
["LFL-Wert",{"$f":"IFERROR(VLOOKUP(B1,Kältemitteltabelle!A3:I170,7),\"0\")","v":"NF"},"kg/m³",null,null,null,null,null,null,"Decklungsfaktor m2",null,false,"Fenstermontage",null,null,{"$f":"IF($O$6=2,1,\"\")","v":""}]
["Molekularemasse",{"$f":"IFERROR(VLOOKUP(B1,Kältemitteltabelle!A3:I170,8),\"0\")","v":102},null,null,null,{"$f":"IF(L8=TRUE,130*$B$7,\"0,00\")&\" \"&\"kg\"","v":"0,00 kg"},null,null,null,"Decklungsfaktor m3",null,false,"Wandmontage",null,null,{"$f":"IF($O$6=3,1.8,\"\")","v":""}]
["Selbstzündungstemp.",{"$f":"IFERROR(VLOOKUP(B1,Kältemitteltabelle!A3:I170,9),\"0\")","v":743},"°C",null,null,null,null,null,null,null,null,null,"Deckenmontage",null,null,{"$f":"IF($O$6=4,2.2,\"\")","v":2.2000000000000002},{"$f":"SUM(P6:P9)","v":2.2000000000000002},{"$f":"2.5*(B7^(5/4))*Q9*(B10^0.5)","v":{"$error":"#VALUE!"}},2,{"$f":"FIXED(R9,S9)","v":{"$error":"#VALUE!"}}]
["Raumfläche",null,"m² --> Berechnung nach C.2",null,null,null,null,null,null,null,null,null,null,null,null,null,null,{"$f":"B11^2/((2.5*(B7^(5/4))*Q9)^2)","v":{"$error":"#VALUE!"}},2,{"$f":"FIXED(R10,S10)","v":{"$error":"#VALUE!"}}]
["KM-Füllmenge in der Anlage",null,"kg --> Berechnung nach C.2"]
[null,null,null,null,null,null,null,null,null,"Weitere Merkmale",null,1]
[null,null,null,null,null,null,null,null,null,"Unter/Oberirdisch",null,1,null,null,null,null,null,null,null,null,null,null,null,null,null,"20 % × LFL × Raumvolumen und nicht mehr als m2"]
["Brennbarkeitsklasse","Kategorie des Zugangsbereichs",null,null,"Aufstellungsort-Klassifikation",null,null,null,null,null,null,null,null,null,null,null,null,null,null,null,null,null,null,null,null,"20 % × LFL × Raumvolumen und nicht mehr als m2"]
[null,null,null,null,"I","II","III","IV",null,null,null,null,null,null,null,null,null,null,null,null,null,null,null,null,null,"20 % × LFL × Raumvolumen und nicht mehr als m2"]
[2,"a","Menschlicher Komfort",null,"Nach C.2 und nicht mehr als m2",null,"Keine Begrenzung der Füllmenge (c)","Füllmenge des Kältemittels nicht mehr als m3",null,null,null,null,null,null,null,null,null,null,null,null,null,null,null,null,null,"20 % × LFL × Raumvolumen und nicht mehr als 10 kg (c)"]
[null,null,"Andere Anwendung",null,"20 % × LFL × Raumvolumen und nicht mehr als m2",null,null,null,null,null,null,null,null,null,null,null,null,null,null,null,null,null,null,null,null,"20 % × LFL × Raumvolumen und nicht mehr als 25 kg (c)"]
[null,"b","Menschlicher Komfort",null,"Nach C.2 und nicht mehr als m2",null,null,null,null,null,null,null,null,null,null,null,null,null,null,null,null,null,null,null,null,"Nur dauerhaft geschlossene Anlagen: 20 % × LFL × Raumvolumen und nicht mehr als 1 kg"]
[null,null,"Andere Anwendung",null,"20 % × LFL × Raumvolumen und nicht mehr als m2",null,null,null,null,null,null,null,null,null,null,null,null,null,null,null,null,null,null,null,null,"Nur dauerhaft geschlossene Anlagen: 20 % × LFL × Raumvolumen und nicht mehr als 1,5 kg"]
[null,"c","Menschlicher Komfort",null,"Nach C.2 und nicht mehr als m2",null,null,null,null,null,null,null,null,null,null,null,null,null,null,null,null,null,null,null,null,"20 % × LFL × Raumvolumen und nicht mehr als 1 kg"]
[null,null,"Andere Anwendung","Unterirdisch","20 % × LFL × Raumvolumen und nicht mehr als m2",null,null,null,null,null,null,null,null,null,null,null,null,null,null,null,null,null,null,null,null,"20 % × LFL × Raumvolumen und nicht mehr als 2,5 kg"]
[null,null,null,"Oberirdisch","20 % × LFL × Raumvolumen und nicht mehr als 10 kg (c)","20 % × LFL × Raumvolumen und nicht mehr als 25 kg (c)",null,null,null,null,null,null,null,null,null,null,null,null,null,null,null,null,null,null,null,"20 % × LFL × Raumvolumen und nicht mehr als 1 kg (c)"]
[3,"a","Menschlicher Komfort",null,"Nach C.2 und nicht mehr als m2 bzw. 1,5 kg",null,"Nicht mehr als 5 kg (c)","Füllmenge des Kältemittels nicht mehr als m3",null,null,null,null,null,null,null,null,null,null,null,null,null,null,null,null,null,"20 % × LFL × Raumvolumen und nicht mehr als 10 kg (c)"]
[null,null,"Andere Anwendung","Unterirdisch","Nur dauerhaft geschlossene Anlagen: 20 % × LFL × Raumvolumen und nicht mehr als 1 kg",null,null,null,null,null,null,null,null,null,null,null,null,null,null,null,null,null,null,null,null,"20 % × LFL × Raumvolumen und nicht mehr als 25 kg (c)"]
[null,null,null,"Oberirdisch","Nur dauerhaft geschlossene Anlagen: 20 % × LFL × Raumvolumen und nicht mehr als 1,5 kg"]
[null,"b","Menschlicher Komfort",null,"Nach C.2 und nicht mehr als m2 bzw. 1,5 kg",null,"Nicht mehr als 10 kg (c)"]
[null,null,"Andere Anwendung","Unterirdisch","20 % × LFL × Raumvolumen und nicht mehr als 1 kg"]
[null,null,null,"Oberirdisch","20 % × LFL × Raumvolumen und nicht mehr als 2,5 kg"]
[null,"c","Menschlicher Komfort",null,"Nach C.2 und nicht mehr als m2 bzw. 1,5 kg",null,"Keine Begrenzung der Füllmenge (c)"]
[null,null,"Andere Anwendung","Unterirdisch","20 % × LFL × Raumvolumen und nicht mehr als 1 kg (c)"]
[null,null,null,"Oberirdisch","20 % × LFL × Raumvolumen und nicht mehr als 10 kg (c)","20 % × LFL × Raumvolumen und nicht mehr als 25 kg (c)"]
[]
["a für die Aufstellung im Freien gilt --> EN 378-3:2016+A1:2020\", 4.2, und für Maschinenräume gilt --> EN 378-3:2016+A1:2020\", 4.3."]
["Brennbarkeitsklasse","Kategorie des Zugangsbereichs",null,null,"Aufstellungsort-Klassifikation"]
[null,null,null,null,"I","II","III","IV"]
[2,"a","Menschlicher Komfort",null,{"$f":"IF(AND(B3=2,'Tabelle C.1_Toxizität'!L10=1,L12=1,(OR('Tabelle C.1_Toxizität'!L11=1,'Tabelle C.1_Toxizität'!L11=2))),E16,\"--\")","v":"--"},null,{"$f":"IF(AND(B3=2,(OR('Tabelle C.1_Toxizität'!L10=1,'Tabelle C.1_Toxizität'!L10=2,'Tabelle C.1_Toxizität'!L10=3)),(OR('Tabelle C.2_Brennbarkeit_2_3'!L12=1,'Tabelle C.2_Brennbarkeit_2_3'!L12=2)),('Tabelle C.1_Toxizität'!L11=3)),G16,\"--\")","v":"--"},{"$f":"IF(AND(B3=2,(OR('Tabelle C.1_Toxizität'!L10=1,'Tabelle C.1_Toxizität'!L10=2,'Tabelle C.1_Toxizität'!L10=3)),(OR('Tabelle C.2_Brennbarkeit_2_3'!L12=1,L12=2)),('Tabelle C.1_Toxizität'!L11=4)),H16,\"--\")","v":"--"}]
[null,null,"Andere Anwendung",null,{"$f":"IF(AND(B3=2,'Tabelle C.1_Toxizität'!L10=1,L12=2,(OR('Tabelle C.1_Toxizität'!L11=1,'Tabelle C.1_Toxizität'!L11=2))),E17,\"--\")","v":"--"}]
[null,"b","Menschlicher Komfort",null,{"$f":"IF(AND(B3=2,'Tabelle C.1_Toxizität'!L10=2,L12=1,(OR('Tabelle C.1_Toxizität'!L11=1,'Tabelle C.1_Toxizität'!L11=2))),E18,\"--\")","v":"--"}]
[null,null,"Andere Anwendung",null,{"$f":"IF(AND(B3=2,'Tabelle C.1_Toxizität'!L10=2,'Tabelle C.2_Brennbarkeit_2_3'!L12=2,(OR('Tabelle C.1_Toxizität'!L11=1,'Tabelle C.1_Toxizität'!L11=2))),E19,\"--\")","v":"--"}]
[null,"c","Menschlicher Komfort",null,{"$f":"IF(AND(B3=2,'Tabelle C.1_Toxizität'!L10=3,L12=1,(OR('Tabelle C.1_Toxizität'!L11=1,'Tabelle C.1_Toxizität'!L11=2))),E20,\"--\")","v":"--"}]
[null,null,"Andere Anwendung","Unterirdisch",{"$f":"IF(AND(B3=2,'Tabelle C.1_Toxizität'!L10=3,L12=2,L13=1,(OR('Tabelle C.1_Toxizität'!L11=1,'Tabelle C.1_Toxizität'!L11=2))),E21,\"--\")","v":"--"}]
[null,null,null,"Oberirdisch",{"$f":"IF(AND(B3=2,'Tabelle C.1_Toxizität'!L10=3,L12=2,L13=2,'Tabelle C.1_Toxizität'!L11=1),E22,\"--\")","v":"--"},{"$f":"IF(AND(B3=2,'Tabelle C.1_Toxizität'!L10=3,L12=2,L13=2,'Tabelle C.1_Toxizität'!L11=2),F22,\"--\")","v":"--"}]
[3,"a","Menschlicher Komfort",null,{"$f":"IF(AND(B3=3,'Tabelle C.1_Toxizität'!L10=1,L12=1,(OR('Tabelle C.1_Toxizität'!L11=1,'Tabelle C.1_Toxizität'!L11=2))),E23,\"--\")","v":"--"},null,{"$f":"IF(AND(B3=3,'Tabelle C.1_Toxizität'!L10=1,'Tabelle C.1_Toxizität'!L11=3,OR(AND(OR(L13=1,L13=2),L12=1),L12=2)),G23,\"--\")","v":"--"},{"$f":"IF(AND(B3=3,(OR('Tabelle C.1_Toxizität'!L10=1,'Tabelle C.1_Toxizität'!L10=2,'Tabelle C.1_Toxizität'!L10=3)),(OR(L12=1,L12=2)),('Tabelle C.1_Toxizität'!L11=4)),H23,\"--\")","v":"--"}]
[null,null,"Andere Anwendung","Unterirdisch",{"$f":"IF(AND(B3=3,'Tabelle C.1_Toxizität'!L10=1,L12=2,L13=1,(OR('Tabelle C.1_Toxizität'!L11=1,'Tabelle C.1_Toxizität'!L11=2))),E24,\"--\")","v":"--"}]
[null,null,null,"Oberirdisch",{"$f":"IF(AND(B3=3,'Tabelle C.1_Toxizität'!L10=1,L12=2,L13=2,(OR('Tabelle C.1_Toxizität'!L11=1,'Tabelle C.1_Toxizität'!L11=2))),E25,\"--\")","v":"--"}]
[null,"b","Menschlicher Komfort",null,{"$f":"IF(AND(B3=3,'Tabelle C.1_Toxizität'!L10=2,L12=1,(OR('Tabelle C.1_Toxizität'!L11=1,'Tabelle C.1_Toxizität'!L11=2))),E26,\"--\")","v":"--"},null,{"$f":"IF(AND(B3=3,'Tabelle C.1_Toxizität'!L10=2,'Tabelle C.1_Toxizität'!L11=3,OR(AND(OR(L13=1,L13=2),L12=1),L12=2)),G26,\"--\")","v":"--"}]
[null,null,"Andere Anwendung","Unterirdisch",{"$f":"IF(AND(B3=3,'Tabelle C.1_Toxizität'!L10=2,L12=2,L13=1,(OR('Tabelle C.1_Toxizität'!L11=1,'Tabelle C.1_Toxizität'!L11=2))),E27,\"--\")","v":"--"}]
[null,null,null,"Oberirdisch",{"$f":"IF(AND(B3=3,'Tabelle C.1_Toxizität'!L10=2,L12=2,L13=2,(OR('Tabelle C.1_Toxizität'!L11=1,'Tabelle C.1_Toxizität'!L11=2))),E28,\"--\")","v":"--"}]
[null,"c","Menschlicher Komfort",null,{"$f":"IF(AND(B3=3,'Tabelle C.1_Toxizität'!L10=3,L12=1,(OR('Tabelle C.1_Toxizität'!L11=1,'Tabelle C.1_Toxizität'!L11=2))),E29,\"--\")","v":"--"},null,{"$f":"IF(AND(B3=3,'Tabelle C.1_Toxizität'!L10=3,'Tabelle C.1_Toxizität'!L11=3,OR(AND(OR(L13=1,L13=2),L12=2),L12=1)),G29,\"--\")","v":"--"}]
[null,null,"Andere Anwendung","Unterirdisch",{"$f":"IF(AND(B3=3,'Tabelle C.1_Toxizität'!L10=3,L12=2,L13=1,(OR('Tabelle C.1_Toxizität'!L11=1,'Tabelle C.1_Toxizität'!L11=2))),E30,\"--\")","v":"--"}]
[null,null,null,"Oberirdisch",{"$f":"IF(AND(B3=3,'Tabelle C.1_Toxizität'!L10=3,L12=2,L13=2,'Tabelle C.1_Toxizität'!L11=1),E31,\"--\")","v":"--"},{"$f":"IF(AND(B3=3,'Tabelle C.1_Toxizität'!L10=3,L12=2,L13=2,'Tabelle C.1_Toxizität'!L11=2),F31,\"--\")","v":"--"}]
["c Für die Aufstellung im Freien gilt !EN 378-3:2016+A1:2020\", 4.2, und für Maschinenräume gilt !EN 378-3, 2016+A1:2020\", 4.3."]

{"sheet":"Füllmengenberechnung","index":4,"n_rows":25,"n_cols":14,"rows_kept":25,"cut":false,"hidden":false,"merged":[[10,4,11,6],[10,7,11,9],[19,4,20,6],[19,7,20,9]]}
[]
[null,null,null,null,null,null,null,null,null,null,null,"Kältemittel                      R",{"$f":"'Tabelle C.1_Toxizität'!B1","v":"134a"}]
["Raumvolumen","Vbrutto =",null,"m³","--> das Raumvolumen nach DIN EN 378-1 wird immer ohne Einbauten betrachtet",null,null,null,null,null,null,"Sicherheitsklasse",{"$f":"IFERROR(VLOOKUP(M2,Kältemitteltabelle!A1:I170,2),\"0\")","v":"A"}]
["Deckung der Einbauten =",null,null,"%","--> Einbauten in Prozent berücksichtigen!!! Falls notwendig!!!",null,null,null,null,null,null,"Brennbarkeit",{"$f":"IFERROR(VLOOKUP(M2,Kältemitteltabelle!A1:I170,3),\"0\")","v":1}]
["Raumvolumen","Vnetto =",{"$f":"C3-(C3*(C4/100))","v":0},"m³","--> Nettovolumen nach Abzug der Einbauten in den Raum",null,null,null,null,null,null,"Fluidgruppe",{"$f":"IFERROR(VLOOKUP(M2,Kältemitteltabelle!A3:I170,4),\"0\")","v":2}]
[null,null,null,null,null,null,null,null,null,null,null,"praktischer Grenzwert",{"$f":"IFERROR(VLOOKUP(M2,Kältemitteltabelle!A3:I170,5),\"0\")","v":0.25},"kg/m³"]
[null,null,null,null,null,null,null,null,null,null,null,"ATEL/ODL",{"$f":"IFERROR(VLOOKUP(M2,Kältemitteltabelle!A3:I170,6),\"0\")","v":0.21},"kg/m³"]
["Füllmengenberechnung -- Toxizität (A, B)",null,null,null,null,null,null,null,null,null,null,"LFL-Wert",{"$f":"IFERROR(VLOOKUP(M2,Kältemitteltabelle!A3:I170,7),\"0\")","v":"NF"},"kg/m³"]
["Die max. Füllmenge des Kältemittels berechnet sich aus der Toxizitätsgrenze x Raumvolumen",null,null,null,null,null,null,null,null,null,null,"Molekularemasse",{"$f":"IFERROR(VLOOKUP(M2,Kältemitteltabelle!A3:I170,8),\"0\")","v":102}]
[null,null,null,null,null,null,null,null,null,null,null,"Selbstzündungstemp.",{"$f":"IFERROR(VLOOKUP(M2,Kältemitteltabelle!A3:I170,9),\"0\")","v":743},"°C"]
["max. Füllmenge ",null,{"$f":"IF(OR(\n  'Tabelle C.1_Toxizität'!D33=\"Toxizitätsgrenze × Raumvolumen oder siehe C.3\",\n  'Tabelle C.1_Toxizität'!D34=\"Toxizitätsgrenze × Raumvolumen oder siehe C.3\",\n  'Tabelle C.1_Toxizität'!D36=\"Toxizitätsgrenze × Raumvolumen oder siehe C.3\",'Tabelle C.1_Toxizität'!D38=\"Für dauerhaft geschlossene Sorptionsanlagen: Toxizitätsgrenze × Raumvolumen und nicht mehr als 2,5 kg; alle weiteren Anlagen, Toxizitätsgrenze × Raumvolumen\",   'Tabelle C.1_Toxizität'!D39=\"Toxizitätsgrenze × Raumvolumen\" ), C5*F25, \"--\")","v":0},"kg",{"$f":"IF(C11=\"--\",\"--\",IF(C11>=C12,\"--Aufstellung möglich--\",\"--Aufstellung nicht möglich--\"))","v":"--Aufstellung möglich--"},null,null,{"$f":"IF(E11=\"--\", \"--\", IF(E11=\"--Aufstellung nicht möglich--\", \"Es müssen weitere Sicherheitsmaßnahmen durchgeführt werden um den Personenschutz zu gewährleisten\", \"keine zusätzlichen Maßnahmen für den Personenschutz notwendig\"))","v":"keine zusätzlichen Maßnahmen für den Personenschutz notwendig"}]
["tats. Füllmenge",null,null,"kg"]
[]
[]
[]
[]
["Füllmengenberechnung -- Brennbarkeit (2L, 2, 3)"]
["Die max. Füllmenge des Kältemittels berechnet sich aus 20% x LFL (oder UEG) x Raumvolumen"]
[]
["max. Füllmenge",null,{"$f":"IFERROR(\n  IF(\n    COUNTIF('Tabelle C.2_Brennbarkeit_2L'!Z13:Z18,'Tabelle C.2_Brennbarkeit_2L'!D28)+\n    COUNTIF('Tabelle C.2_Brennbarkeit_2L'!Z13:Z18,'Tabelle C.2_Brennbarkeit_2L'!D30)+\n    COUNTIF('Tabelle C.2_Brennbarkeit_2L'!Z13:Z18,'Tabelle C.2_Brennbarkeit_2L'!E30)+\n    COUNTIF('Tabelle C.2_Brennbarkeit_2L'!Z13:Z18,'Tabelle C.2_Brennbarkeit_2L'!D32)+\n    COUNTIF('Tabelle C.2_Brennbarkeit_2L'!Z13:Z18,'Tabelle C.2_Brennbarkeit_2L'!E32)+\n    COUNTIF('Tabelle C.2_Brennbarkeit_2L'!Z13:Z18,'Tabelle C.2_Brennbarkeit_2L'!E33)+\n    COUNTIF('Tabelle C.2_Brennbarkeit_2_3'!Z13:Z24,'Tabelle C.2_Brennbarkeit_2_3'!E17)+\n    COUNTIF('Tabelle C.2_Brennbarkeit_2_3'!Z13:Z24,'Tabelle C.2_Brennbarkeit_2_3'!E19)+\n    COUNTIF('Tabelle C.2_Brennbarkeit_2_3'!Z13:Z24,'Tabelle C.2_Brennbarkeit_2_3'!E21)+\n    COUNTIF('Tabelle C.2_Brennbarkeit_2_3'!Z13:Z24,'Tabelle C.2_Brennbarkeit_2_3'!E22)+\n    COUNTIF('Tabelle C.2_Brennbarkeit_2_3'!Z13:Z24,'Tabelle C.2_Brennbarkeit_2_3'!F22)+\n    COUNTIF('Tabelle C.2_Brennbarkeit_2_3'!Z13:Z24,'Tabelle C.2_Brennbarkeit_2_3'!E24)+\n    COUNTIF('Tabelle C.2_Brennbarkeit_2_3'!Z13:Z24,'Tabelle C.2_Brennbarkeit_2_3'!E25)+\n    COUNTIF('Tabelle C.2_Brennbarkeit_2_3'!Z13:Z24,'Tabelle C.2_Brennbarkeit_2_3'!E27)+\n    COUNTIF('Tabelle C.2_Brennbarkeit_2_3'!Z13:Z24,'Tabelle C.2_Brennbarkeit_2_3'!E28)+\n    COUNTIF('Tabelle C.2_Brennbarkeit_2_3'!Z13:Z24,'Tabelle C.2_Brennbarkeit_2_3'!E30)+\n    COUNTIF('Tabelle C.2_Brennbarkeit_2_3'!Z13:Z24,'Tabelle C.2_Brennbarkeit_2_3'!E31)+\n    COUNTIF('Tabelle C.2_Brennbarkeit_2_3'!Z13:Z24,'Tabelle C.2_Brennbarkeit_2_3'!F31)\n    > 0,\n    0.2*M8*C5,\n    \"--\"\n  ),\n  \"--\"\n)","v":"--"},"kg",{"$f":"IF(C20=\"--\",\"--\",IF(C20>=C21,\"--Aufstellung möglich--\",\"--Aufstellung nicht möglich--\"))","v":"--"},null,null,{"$f":"IF(E20=\"--\", \"--\", IF(E20=\"--Aufstellung nicht möglich--\", \"Es müssen weitere Sicherheitsmaßnahmen durchgeführt werden um den Personenschutz zu gewährleisten\", \"keine zusätzlichen Maßnahmen für den Personenschutz notwendig\"))","v":"--"}]
["tats. Füllmenge",null,null,"kg"]
[]
[]
[]
[null,null,null,null,null,{"$f":"MAX(M6,M7)","v":0.25}]

{"sheet":"Notbelüftung","index":5,"n_rows":10,"n_cols":8,"rows_kept":10,"cut":false,"hidden":false,"merged":[[3,3,3,9],[1,0,1,9]]}
[]
["Erforderlicher-Luftstrom für die mechanische Notlüftung"]
[]
["m",null,"kg   -->","Masse der Kältemittel-Füllmenge, in kg in der Kälteanlage mit der größten Füllmenge, die sich mit irgendeinem Teil in dem Maschinenraum befindet"]
["VABL",{"$f":"0.014*(B4^(2/3))","v":0},"m³/s",{"$f":"B5*3600","v":0},"m³/h","VZU",{"$f":"0.9*D5","v":0},"m³/h"]
[]
[]
["Fläche"]
["Höhe"]
["V",{"$f":"B8*B9*15","v":0},"m³/h  -->","15-facher Luftwechsel je Stunde sind für das Notlüftungssystem ausreichend"]

{"sheet":"Schutz der Kälteanlage_Teil A","index":6,"n_rows":10,"n_cols":9,"rows_kept":10,"cut":false,"hidden":false,"merged":[[7,7,7,8],[0,4,1,4],[5,0,5,1],[5,2,5,3],[8,0,8,1],[8,2,8,3],[7,5,7,6],[1,5,1,6],[1,7,1,8],[4,5,4,6],[4,7,4,8],[2,0,2,1],[0,0,0,3],[2,2,2,3]]}
["START - Alle Schritte für jeden Teil der Kälteanlage wiederholen",null,null,null,null,"E N D E","---"]
["1. Durch Flüssigkeitspumpe erzeugter überhöhter Innendruck?",null,"2. Überhöhter Innendruck durch niedrige Temperaturen / Einfrieren?",null,null,2,null,2]
[{"$f":"IF(F2=1,F3,G3)","v":"Abfrage: Überhöhter Innendruch durch niedrige Termperaturen / Einfrieren"},null,{"$f":"IF(H2=1,H3,I3)","v":"Abfrage: Durch Flüssigkeitsausdehnung erzeugter überhöhter Innendruck"},null,null,"Es ist ein an der Druckseite der Pumpe montiertes Druckentlastungsventil erfoderlich, das zur Ansaugseite der Pumpe oder in das Flüssigkeitsreservoir (z. B. Abscheider) abbläst. Alternative Maßnahmen können verwendet werden, um das gleiche Ergebnis sicherzustellen, z. B. Mindestdurchfluss-Leitungen.                                                                                                                                                     ----------------------------------------------------------------------------------------------------------------------------------Nächste Abfrage: Überhöhter Innendruck durch niedrige Temperaturen / Einfrieren","Abfrage: Überhöhter Innendruch durch niedrige Termperaturen / Einfrieren","Der Abschnitt der Kälteanlage ist durch einen Niederdruckbegrenzer für den Verdichter in Kombination mit einer Druchfluss-Überwachung im Sekundärkreislauf (z. B. Solekreislauf) zu schützen. Alternative Maßnahmen können verwendet werden, um das gleiche Ergebnis sicherzustellen.                                                                                                                                                 ---------------------------------------------------------------------------------------------------------------------------------- Nächste Abfrage: Durch Flüssigkeitsausdehnung erzeugter überhöhter Innendruck","Abfrage: Durch Flüssigkeitsausdehnung erzeugter überhöhter Innendruck"]
[null,null,null,null,null,"2. Überhöhter Innendruck durch niedrige Temperaturen / Einfrieren?","3. Druch Flüssigkeitsausdehnung erzeuger überhöhter Innendruck"]
["3. Druch Flüssigkeitsausdehnung erzeuger überhöhter Innendruck",null,"4. Durch intere/externe Wärmequelle(n) erzeugter überhöhter Innendruck?",null,null,2,null,2]
[{"$f":"IF(F5=1,F6,G6)","v":"Abfrage: Durch interne/externe Wärmequelle(n) erzeugter überhöhter Innendruck?"},null,{"$f":"IF(H5=1,H6,I6)","v":"Abfrage: Durch Verdichter erzeugter überhöhter Innendruck?"},null,null,"Soweit ausfühbar, ist eine Druckanstieg infolge von Flüssigkeitsausdehnung durch in OFFEN-Stellung gesicherte Ventile zu vermeiden. In allen anderen Fällen sind Druckentlastungseinrichtungen anzuwenden, wie für \"interne/externe Wärmequelle(n)\" gefordert. Alernative Maßnahmen können verwendet werden, um das gleiche Ergebnis sicherzustellen.                                                                                                                                                                                                          ----------------------------------------------------------------------------------------------------------------------------------Nächste Abfrage: Durch interne / externe Wärmequelle(n) erzeugter überhöhter Innendruck.","Abfrage: Durch interne/externe Wärmequelle(n) erzeugter überhöhter Innendruck?","Soweit ausführbar, ist die Wärmequelle mit einer Sicherheitsschalteinrichtung zur Druckbegrenzung ausfallsicher zu stoppen. In allen anderen Fällen ist mindestens 1x Druckentlastungseinrichtung erforderlich. Für geschützte Druckgeräte der Kategorie II/III/IV müssen angemessene Vorkehrungen getroffen werden, um eine gefahrlose Demontage des Druckentlastungsventils zu ermöglichen. Dies kann zum Beispiel erreicht werden durch den Einsatz von 2x Druckentlastungsventilen (von denen jedes über die erforderliche Abblaseleistung verfügt), die über ein Wechselventil oder 2 Offen gesicherte Ventile angeschlossen sind. Alternaive Maßnahmen kännen verwendet werden, um das gleiche Ergebnis sicherzustellen.                     ---------------------------------------------------------------------------------------------------------------------------------- Nächte Abfrage: Durch Verdichter erzeugter ünerhöhter Innendruck?","Abfrage: Durch Verdichter erzeugter überhöhter Innendruck?"]
[null,null,null,null,null,"4. Durch intere/externe Wärmequelle(n) erzeugter überhöhter Innendruck?","5. Durch Verdichter erzeugter überhöhter Innendruck?"]
["5. Durch Verdichter erzeugter überhöhter Innendruck?",null,"6. Durch Antriebs-Wärmequelle der Sorptionsanlage verursachter überhöhter Innendruck",null,null,2,null,2]
[{"$f":"IF(F8=1,F9,G9)","v":"Abfrage: Durch Antriebs-Wärmequelle der Sorptionsanlage verursachter überhöhter Innendruck?"},null,{"$f":"IF(H8=1,H9,I9)","v":"E N D E"},null,null,"Wenn zu schützende Druckgeräte der Kategorie ≥ I in der Kälteanlage enthalten sind, sind Schutzeinrichtungen nach Teil B anzuwenden. In allen anderen Fällen sind Maßnahmen nach Teil C anzuwenden.","Abfrage: Durch Antriebs-Wärmequelle der Sorptionsanlage verursachter überhöhter Innendruck?","Es sind Maßnahmen nach Teil D zu treffen","E N D E"]
[null,null,null,null,null,"6. Durch Antriebs-Wärmequelle der Sorptionsanlage verursachter überhöhter Innendruck"]

{"sheet":"Schutz der Kälteanlage_Teil B","index":7,"n_rows":8,"n_cols":9,"rows_kept":8,"cut":false,"hidden":false,"merged":[[4,5,4,6],[4,7,4,8],[0,0,0,3],[1,5,1,6],[1,7,1,8],[2,0,2,1],[2,2,2,3],[5,0,5,1],[7,5,7,6],[7,7,7,8],[8,0,8,1],[8,2,8,3]]}
["START - Alle Schritte für jeden Teil der Kälteanlage wiederholen",null,null,null,null,"E N D E","---"]
["1. Verdrängungsverdichter in der Anlage?",null,{"$f":"IF(A3=F3,F4,G1)","v":"---"},null,null,2,null,1]
[{"$f":"IF(F2=1,F3,G3&F1)","v":"Ein Druckwächter (PSH) oder ein Druckentlastungsventil oder eine Pumpenschutzeinrichtung ist erforderlich.                                                                                                                                               --------------------------------------------------------------------------------------------------------------------------------E N D E"},null,{"$f":"IF(C2=G1,\"---\",IF(AND(C2=\"2. Gesamthubvolumen je Verdängungserdichter < 25 l/s (90 m³/h)?\",H2=1),H3,IF(AND(C2=\"2. Gesamthubvolumen je Verdängungserdichter < 25 l/s (90 m³/h)?\",H2=2),I3,\"---\")))","v":"---"},null,null,"Nächste Abfrage: Gesamthubvolumen des Verdichter?","Ein Druckwächter (PSH) oder ein Druckentlastungsventil oder eine Pumpenschutzeinrichtung ist erforderlich.                                                                                                                                               --------------------------------------------------------------------------------------------------------------------------------","Ein Druckbegrenzer (PZH) ist für jeden Verdichter erforderlich, alternativ kann bei kleineren Systemen jedoch ein Druckwächter (PSH) ausreichend sein, siehe Fußnote 1.                                                                                                               -------------------------------------------------------------------------------------------------------------------------Fußnote 1: Bei kleineren Anlagen mit Kältemittel-Füllmengen < 100kg (A1) oder < 30kg (A2L) oder 5kg (A3) wird ein Druckwächter (PSH) als ausreichend angesehen, vorausgesetzt das automatische Reset beeinträchtigt nicht das Sicherheitsniveau.                                                                                                   ---------------------------------------------------------------------------------------------------------------------------------- E N D E","Es ist eine für den Massenstrom des/der Verdichter(s) dimensionierte Druckentlastungseinrichtung nach EN 13136, 6.3, erforderlich.                                                                  ---------------------------------------------------------------------------------------------------------------------------------Nächste Abfrage: Ist der Ansprechdruck der Entlastungseinrichtung > PS des Abschnitts der Kälteanlage?"]
[null,null,null,null,null,"2. Gesamthubvolumen je Verdängungserdichter < 25 l/s (90 m³/h)?","3. Ist der Ansprechdruck der Entlastungseinrichtung > PS des Abschnitts der Kälteanlage?"]
[{"$f":"IF(C3=I3,G4,G1)","v":"---"},null,null,null,null,1,null,1]
[{"$f":"IF(A5=G1,\"---\",IF(AND(A5=G4,F5=1),F6,IF(AND(A5=G4,F5=2),G6,\"---\")))","v":"---"},null,null,null,null,"Ein Sicherheits-Druckbegrenzer (PZHH) und ein zweiter paralleler Druckbegrenzer (PZH), die elektrisch in Reihe geschaltet sind, sind für jeden Verdichter erforderlich.                                                                                            ----------------------------------------------------------------------------------------------------------------------------------E N D E","Ein Druckbegrenzer (PZH) ist für jeden Verdichter erforderlich                                                                                                                  ----------------------------------------------------------------------------------------------------------------------------------E N D E"]
[null,null,null,null,null,"WENN(A5=G1;\"---\";WENN(UND(A5=\"3. Ist der Ansprechdruck der Entlastungseinrichtung > PS des Abschnitts der Kälteanlage?;F5=1);F6;WENN(UND(A5=\"3. Ist der Ansprechdruck der Entlastungseinrichtung > PS des Abschnitts der Kälteanlage?\";F5=2);G6;\"---\")))"]
[null,null,null,null,null,0,null,1]

{"sheet":"Schutz der Kälteanlage_Teil C","index":8,"n_rows":6,"n_cols":9,"rows_kept":6,"cut":false,"hidden":false,"merged":[[5,0,5,1],[7,5,7,6],[7,7,7,8],[8,0,8,1],[8,2,8,3],[4,7,4,8],[0,0,0,3],[1,5,1,6],[1,7,1,8],[2,0,2,1],[2,2,2,3]]}
["START - Alle Schritte für jeden Teil der Kälteanlage wiederholen",null,null,null,null,"E N D E","---"]
["1. Kälteanlage erfüllt Eigensicherheitsprüfung in Anhang C?",null,{"$f":"IF(A3=F4,F6,G1)","v":"---"},null,null,1,null,2]
[{"$f":"IF(F2=1,F3&F1,IF(F2=2,G3,\"---\"))","v":"Keine zusätzlichen Maßnahmen.                                                                                                                                ----------------------------------------------------------------------------------------------------------------------------------E N D E"},null,{"$f":"IF(C2=G1,\"---\",IF(H2=1,H3&F1,I3&F1))","v":"---"},null,null,"Keine zusätzlichen Maßnahmen.                                                                                                                                ----------------------------------------------------------------------------------------------------------------------------------","Abfrage Wird der Verdichter von einer Motorverdichter-Schutzeinrichtung…","Keine zusätzlichen Maßnahmen.                                                                                                                                ----------------------------------------------------------------------------------------------------------------------------------","Ein Druckwächter (PSH) ist erforderlich                                                                                                 ----------------------------------------------------------------------------------------------------------------------------------"]
[null,null,null,null,null,"Abfrage Wird der Verdichter von einer Motorverdichter-Schutzeinrichtung…"]
[]
[null,null,null,null,null,"2. Wird der Verdichter von einer Motorverdichter-Schutzeinrichtung nach EN 60335-2-34 abgeschaltet, bevor PS des Abschnitts der Kälteanlage erreicht wird?"]

{"sheet":"Schutz der Kälteanlage_Teil D","index":9,"n_rows":6,"n_cols":9,"rows_kept":6,"cut":false,"hidden":false,"merged":[[5,0,5,1],[7,5,7,6],[7,7,7,8],[8,0,8,1],[8,2,8,3],[4,7,4,8],[0,0,0,3],[1,5,1,6],[1,7,1,8],[2,0,2,1],[2,2,2,3]]}
["START - Alle Schritte für jeden Teil der Kälteanlage wiederholen",null,null,null,null,"E N D E","---"]
["1. Wärmeaufnahme > 70 kW?",null,{"$f":"IF(A3=G3,F6,G1)","v":"---"},null,null,1,null,2]
[{"$f":"IF(F2=1,F3&F1,IF(F2=2,G3,\"---\"))","v":"Ein Sicherhietsdruckbegrenzer (PZHH) und ein zweiter Druckbegrenzer (PZH), die elektrisch in Reihe geschaltet sind, in Kombination mit einer Aus-/ Abschaltvorrichtung die die Wärmezufuhr zum Generator fehlersicher für die Sorptionsanlage abschaltet                                                                                                                                ----------------------------------------------------------------------------------------------------------------------------------E N D E"},null,{"$f":"IF(C2=G1,\"---\",IF(H2=1,H3&F1,I3&F1))","v":"---"},null,null,"Ein Sicherhietsdruckbegrenzer (PZHH) und ein zweiter Druckbegrenzer (PZH), die elektrisch in Reihe geschaltet sind, in Kombination mit einer Aus-/ Abschaltvorrichtung die die Wärmezufuhr zum Generator fehlersicher für die Sorptionsanlage abschaltet                                                                                                                                ----------------------------------------------------------------------------------------------------------------------------------","Ein Sicherheits-Druckbegrenzer (PZHH) in Kombination mit einer Aus- / Abschaltvorrichtung, die die Wärmezufuhr zum Genderator fehlersicher für die Sorptionsanlage abschaltet                                                                                                                                ----------------------------------------------------------------------------------------------------------------------------------Abfrage Gasbefeuertes Sorptionssystem?","Zusätzliche Anforderungen nach EN 12309-2:2015 sind zu erfüllen                                                                                                                                ----------------------------------------------------------------------------------------------------------------------------------","Keine zusätzlichen Anforderungen.                                                                                                         ----------------------------------------------------------------------------------------------------------------------------------"]
[null,null,null,null,null,"Abfrage Wird der Verdichter von einer Motorverdichter-Schutzeinrichtung…"]
[]
[null,null,null,null,null,"2. Gasbefeuertes Sorptionssystem?"]

{"sheet":"DGRL_Behälter","index":10,"n_rows":30,"n_cols":19,"rows_kept":30,"cut":false,"hidden":false,"merged":[[21,5,21,12],[22,7,22,12],[25,5,25,12],[26,7,27,8],[28,5,28,12],[29,7,29,8],[0,17,0,18],[0,15,0,16],[0,4,0,5],[0,6,0,7],[5,1,5,4],[0,0,1,0],[0,1,1,1],[0,2,1,2],[0,3,1,3],[7,0,7,3],[7,4,7,7],[17,0,18,0],[17,1,18,1],[17,2,18,2],[17,3,18,3],[25,3,27,4],[28,3,29,4],[26,9,27,12],[29,9,29,12],[21,0,24,0],[21,1,24,2],[21,3,23,4],[22,5,23,6],[23,9,23,10],[23,11,23,12],[24,3,24,4],[25,0,29,0],[25,1,27,2],[28,1,29,2]]}
["Fluidgruppe","Aggregatzustand","PS","V","Prüfung DGRL",null,"Prüfung BetrSichV*",null,"Kältemittel                 R",{"$f":"'Tabelle C.1_Toxizität'!B1","v":"134a"},null,null,null,null,null,"Fulidgruppe 1",null,"Fluidgruppe 2"]
[null,null,null,null,"PS * V","Kategorie","Prüfung IB","wiederkehrend","Sicherheitsklasse",{"$f":"'Tabelle C.1_Toxizität'!B2","v":"A"},null,null,null,null,null,"Druck","Volumen","Druck","Volumen"]
[{"$f":"IF(J4=1,\"1\",\"--\")","v":"--"},"Gas",null,null,{"$f":"IF(OR(C3=\"\",D3=\"\"),\"---\",C3*D3)","v":"---"},{"$f":"IF(OR(C3=\"\",D3=\"\"),\"---\",IF(C3<=0.5,\"DGRL trifft nicht zu\",IF(AND(C3>0.5,C3<=200,D3<=1),\"Art.4 Abs.3\",IF(AND(C3>0.5,C3<=20,D3>1,E3<=25),\"Art.3 Abs.4\",IF(AND(C3>0.5,C3<=200,D3>1,E3<=50),\"Kat. I\",IF(AND(C3>0.5,C3<=200,D3>1,E3<=200),\"Kat. II\",IF(AND(C3>200,C3<=1000,D3<=1),\"Kat. III\",IF(AND(C3>0.5,C3<=1000,D3>1,E3>200,E3<=1000),\"Kat. III\",IF(AND(C3>0.5,C3<=1000,D3>1,E3>1000),\"Kat. IV\",IF(AND(C3>1000,D3>1,E3>1000),\"Kat. IV\",\"XXX\"))))))))))","v":"---"},{"$f":"IF(F3=\"---\",\"--\",IF(F3<=\"Kat. II\",\"bP\",\"ZÜS\"))","v":"--"},{"$f":"IF(F3=\"---\",\"--\",IF(E3<=1000,\"bP\",\"ZÜS\"))","v":"--"},"Brennbarkeit",{"$f":"'Tabelle C.1_Toxizität'!B3","v":1}]
[{"$f":"IF(J4=2,\"2\",\"--\")","v":"2"},"Gas",null,null,{"$f":"IF(OR(C4=\"\",D4=\"\"),\"---\",C4*D4)","v":"---"},{"$f":"IF(OR(C4=\"\",D4=\"\"),\"---\",IF(C4<=0.5,\"DGRL trifft nicht zu\",\nIF(AND(C4>0.5,C4<=1000,D4<=1),\"Art. 4 Abs. 3\",\nIF(AND(C4>1000,C4<=3000,D4<=1),\"Kat. III\",\nIF(AND(C4>0.5,C4<=1000,D4>1,E4<=50),\"Art. 4 Abs. 3\",\nIF(AND(C4>0.5,C4<=1000,D4>1,E4>50,E4<=200),\"Kat. I\",\nIF(AND(C4>0.5,C4<=1000,D4>1,E4>200,E4<=1000),\"Kat. II\",\nIF(AND(C4>0.5,C4<=3000,D4>1,E4>1000,E4<=3000),\"Kat. III\",\nIF(AND(C4>0.5,C4<=4,D4>750,E4>3000),\"Kat. III\",\nIF(AND(C4>4,D4>1,E4>3000),\"Kat. IV\",\n\"Kat. IV\"))))))))))","v":"---"},{"$f":"IF(F4=\"---\",\"--\",IF(F4<=\"Kat. I\",\"bP\",\"ZÜS\"))","v":"--"},{"$f":"IF(F4=\"---\",\"--\",IF(E4<=1000,\"bP\",\"ZÜS\"))","v":"--"},"Fluidgruppe",{"$f":"'Tabelle C.1_Toxizität'!B4","v":2},null,null,null,null,null,0.5,0.1,3000,0.1]
[{"$f":"IF(A3=\"1\",\"MODULE:\",\"\")","v":""},{"$f":"IF(F3=\"Art.4 Abs.3\",\"kein Modul\",IF(F3=\"Kat. I\",\"A\",IF(F3=\"Kat. II\",\"A2 oder D1 oder E1\",IF(F3=\"Kat. III\",\"B(E)+F oder B(B)+C2 oder B(E)+D oder B(B)+E oder H\",IF(F3=\"Kat. IV\",\"G oder B(B)+F oder B(B)+D oder H1\",\"\")))))","v":""},null,null,null,null,null,null,"praktischer Grenzwert",{"$f":"'Tabelle C.1_Toxizität'!B5","v":0.25},"kg/m³",null,null,null,null,0.5,1,3000,1]
[{"$f":"IF(A4=\"2\",\"MODULE:\",\"\")","v":"MODULE:"},{"$f":"IF(F4=\"Art.4 Abs.3\",\"kein Modul\",IF(F4=\"Kat. I\",\"A\",IF(F4=\"Kat. II\",\"A2 oder D1 oder E1\",IF(F4=\"Kat. III\",\"B(E)+F oder B(B)+C2 oder B(E)+D oder B(B)+E oder H\",IF(F4=\"Kat. IV\",\"G oder B(B)+F oder B(B)+D oder H1\",\"\")))))","v":""},null,null,null,null,null,null,"ATEL/ODL",{"$f":"'Tabelle C.1_Toxizität'!B6","v":0.21},"kg/m³",null,null,null,null,0.5,100,4,750]
[null,null,null,null,null,null,null,null,"LFL-Wert",{"$f":"'Tabelle C.1_Toxizität'!B7","v":"NF"},"kg/m³",null,null,null,null,0.5,1000,4,10000]
[{"$f":"IF(A3=\"1\",\"Fluidgruppe 1 / Gas\",\"\")","v":""},null,null,null,{"$f":"IF(A4=\"2\",\"Fluidgruppe 2 / Gas\",\"\")","v":"Fluidgruppe 2 / Gas"},null,null,null,"Molekularemasse",{"$f":"'Tabelle C.1_Toxizität'!B8","v":102},null,null,null,null,null,0.5,2000,1000,0.1]
["PS","V","PS*V","Kategorie","PS","V","PS*V","Kategorie","Selbstzündungstemp.",{"$f":"'Tabelle C.1_Toxizität'!B9","v":743},"°C",null,null,null,null,null,null,1000,1]
["<=0,5","---","---","DGRL Trifft nicht zu","<=0,5",null,null,"DGRL trifft nicht zu",null,null,null,null,null,null,null,1000,0.1,0.5,2000]
[">0,5<=200","<=1","---","Art.4 Abs.3",">0,5<=1000","<=1",null,"Art. 4 Abs. 3",null,null,null,null,null,null,null,1000,1]
[">0,5<=200",">1","<=25","Art.4 Abs.3",">1000<=3000","<=1",null,"Kat. III",null,null,null,null,null,null,null,0.5,2000,1000,1]
[">0,5<=200",">1",">25<=50","Kat. I",">0,5<=1000",">1","<=50","Art. 4 Abs. 3",null,null,null,null,null,null,null,null,null,50,1]
[">0,5<=200",">1",">50<=200","Kat.II",">0,5<=1000",">1",">50<=200","Kat. I",null,null,null,null,null,null,null,200,0.1]
[">200<=1000","<=1",null,"Kat. III",">0,5<=1000",">1",">200<=1000","Kat. II",null,null,null,null,null,null,null,200,1,200,1]
[">0,5<=1000",">1",">200<=1000","Kat. III",">0,5<=3000",">1",">1000<=3000","Kat. III",null,null,null,null,null,null,null,0.5,400,0.5,400]
[">0,5<=1000",">1",">1000","Kat. IV",">0,5<=4",">750",">3000","Kat. III"]
[">1000",null,null,"Kat. IV",">4",">1",">3000","Kat. IV",null,null,null,null,null,null,null,200,1,50,1]
[null,null,null,null,">3000",null,null,"Kat. IV",null,null,null,null,null,null,null,25,1,0.5,100]
[]
["* Auszug Tabelle 12 BetrSichV - Prüfanforderungen für bestimmt Druckanlagen und Anlagenteile"]
["Nr.","Druckanlage/Anlagenteil",null,"Prüfungen IB",null,"wiederkehrend"]
[null,null,null,null,null,"Prüfung der Druckanlage",null,"Prüfung der Anlagenteile"]
[null,null,null,null,null,null,null,"äußere Prüfung",null,"innere Prüfung",null,"Festigkeitsprüfung",null,null,null,50,1]
[null,null,null,"Prüfzuständigkeit",null,"Prüfzuständigkeit","Höchstfrist","Prüfzuständigkeit","Höchstfrist","Prüfzustän-digkeit","Höchstfrist","Prüfzustän-digkeit","Höchstfrist",null,null,0.5,100]
["7.2 Kälte- und Wärmepumpenanlagen, die mit folgenden Fluiden in geschlossenen Kreisläufen betrieben werden","a) mit Fluiden der Fluidgruppe 1 nach Nr. 2.3 Buchstabe b",null,{"$f":"G3","v":"--"},null,{"$f":"\" Prüfzuständigkeit \" & H3","v":" Prüfzuständigkeit --"}]
[null,null,null,null,null,{"$f":"IF(H3 =\"ZÜS\",\"ZÜS\",\"\")","v":""},{"$f":"IF(H3=\"ZÜS\",\"5 Jahre\",\"\")","v":""},"entfällt",null,"wiederkehrende Prüfungen der Anlagenteile müssen nur durchgeführt werden, wenn das Anlagenteil zu Instandsetzungsarbeiten außer Betrieb genommen wird",null,null,null,null,null,25,1]
[null,null,null,null,null,{"$f":"IF(H3 =\"bP\",\"bP\",\"\")","v":""},{"$f":"IF(H3=\"bP\",\"10 Jahre\",\"\")","v":""},null,null,null,null,null,null,null,null,0.5,50]
[null,"b) mit allen anderen Fluiden, die\nnicht unter Fluidgruppe 1 genannt sind",null,{"$f":"G4","v":"--"},null,{"$f":"\"Prüfzuständigkeit \" & H4","v":"Prüfzuständigkeit --"}]
[null,null,null,null,null,{"$f":"IF(OR(H4=\"ZÜS\", H4=\"bP\", H4=\"\"), \"ZÜS/bP\", \"\")","v":""},{"$f":"IF(OR(H4=\"ZÜS\", H4=\"bP\"), \"10 Jahre\", \"\")","v":""},"entfällt",null,"wiederkehrende Prüfungen der Anlagenteile müssen nur durchgeführt werden, wenn das Anlagenteil zu Instandsetzungsarbeiten außer Betrieb genommen wird"]

{"sheet":"DGRL_Rohrltg.","index":11,"n_rows":16,"n_cols":11,"rows_kept":16,"cut":false,"hidden":false,"merged":[[0,4,0,5],[0,6,0,7],[0,0,1,0],[0,1,1,1],[0,2,1,2],[0,3,1,3],[6,0,6,3],[6,4,6,7],[14,0,15,0],[14,1,15,1],[14,2,15,2],[14,3,15,3]]}
["Fluidgruppe","Aggregatzustand","PS","DN","Prüfung DGRL",null,"Prüfung BetrSichV*",null,"Kältemittel                 R",{"$f":"'Tabelle C.1_Toxizität'!B1","v":"134a"}]
[null,null,null,null,"PS * DN","Kategorie","Prüfung IB","wiederkehrend","Sicherheitsklasse",{"$f":"'Tabelle C.1_Toxizität'!B2","v":"A"}]
[{"$f":"IF(J4=1,\"1\",\"---\")","v":"---"},"Gas",null,null,{"$f":"IF(OR(C3=\"\",D3=\"\"),\"---\",C3*D3)","v":"---"},{"$f":"IF(OR(C3=\"\",D3=\"\"),\"---\",IF(C3<=0.5,\"DGRL trifft nicht zu\",\nIF(AND(C3>0.5,D3<=25),\"Art.4 Abs.3\",\nIF(AND(C3>0.5,D3<=100,E3<=1000),\"Kat. I\",\nIF(AND(C3>0.5,D3<=100,E3>1000),\"Kat. II\",\nIF(AND(C3>0.5,D3>100,D3<=3000,E3<=3500),\"Kat. II\",\nIF(AND(C3>0.5,D3>100,D3<=3000,E3>3500),\"Kat. III\",\nIF(AND(C3>0.5,D3>350),\"Kat. III\",\"\"))))))))","v":"---"},{"$f":"IF(OR(NOT(ISNUMBER(C3)),NOT(ISNUMBER(D3))),\"--\",\nIF(D3<=25,\"Arbeitsmittel\",\nIF(AND(C3>0.5,C3*D3<=2000),\"bP\",\nIF(AND(C3>0.5,C3*D3>2000),\"ZÜS\",\n\"--\"))))","v":"--"},{"$f":"IF(OR(NOT(ISNUMBER(C3)),NOT(ISNUMBER(D3))),\"--\",\nIF(D3<=25,\"Arbeitsmittel\",\nIF(AND(C3>0.5,C3*D3<=2000),\"bP\",\nIF(AND(C3>0.5,C3*D3>2000),\"ZÜS\",\n\"--\"))))","v":"--"},"Brennbarkeit",{"$f":"'Tabelle C.1_Toxizität'!B3","v":1}]
[{"$f":"IF(J4=2,\"2\",\"---\")","v":"2"},null,null,null,{"$f":"IF(OR(C4=\"\",D4=\"\"),\"---\",C4*D4)","v":"---"},{"$f":"IF(OR(C4=\"\",D4=\"\"),\"---\",IF(C4<=0.5,\"DGRL trifft nicht zu\",IF(AND(C4>0.5,D4<=32),\"Art. 4 Abs. 3\",IF(AND(C4>0.5,D4>32,E4<=1000),\"Art. 4 Abs. 3\",IF(AND(C4>0.5,D4>32,D4<=100,E4>1000),\"Kat. I\",IF(AND(C4>0.5,D4>100,E4>1000,E4<=3500),\"Kat. I\",IF(AND(C4>0.5,D4>100,D4<=250,E4>3500),\"Kat. II\",IF(AND(C4>0.5,D4>250,E4>3500,E4<=5000),\"Kat. II\",IF(AND(C4>0.5,D4>250,E4>5000),\"Kat. III\",\"\")))))))))","v":"---"},"Arbeitsmittel","Arbeitsmittel","Fluidgruppe",{"$f":"'Tabelle C.1_Toxizität'!B4","v":2}]
[{"$f":"IF(A3=\"1\",\"MODULE:\",\"\")","v":""},{"$f":"IF(F3=\"Art.4 Abs.3\",\"kein Modul\",IF(F3=\"Kat. I\",\"A\",IF(F3=\"Kat. II\",\"A2 oder D1 oder E1\",IF(F3=\"Kat. III\",\"B(E)+F oder B(B)+C2 oder B(E)+D oder B(B)+E oder H\",IF(F3=\"Kat. IV\",\"G oder B(B)+F oder B(B)+D oder H1\",\"\")))))","v":""},null,null,null,null,null,null,"praktischer Grenzwert",{"$f":"'Tabelle C.1_Toxizität'!B5","v":0.25},"kg/m³"]
[{"$f":"IF(A4=\"2\",\"MODULE:\",\"\")","v":"MODULE:"},{"$f":"IF(F4=\"Art.4 Abs.3\",\"kein Modul\",IF(F4=\"Kat. I\",\"A\",IF(F4=\"Kat. II\",\"A2 oder D1 oder E1\",IF(F4=\"Kat. III\",\"B(E)+F oder B(B)+C2 oder B(E)+D oder B(B)+E oder H\",IF(F4=\"Kat. IV\",\"G oder B(B)+F oder B(B)+D oder H1\",\"\")))))","v":""},null,null,null,null,null,null,"ATEL/ODL",{"$f":"'Tabelle C.1_Toxizität'!B6","v":0.21},"kg/m³"]
[{"$f":"IF(A3=\"1\",\"Fluidgruppe 1 / Gas\",\"\")","v":""},null,null,null,{"$f":"IF(A4=\"2\",\"Fluidgruppe 2 / Gas\",\"\")","v":"Fluidgruppe 2 / Gas"},null,null,null,"LFL-Wert",{"$f":"'Tabelle C.1_Toxizität'!B7","v":"NF"},"kg/m³"]
["PS","DN","PS*DN","Kategorie","PS","DN","PS*DN","Kategorie","Molekularemasse",{"$f":"'Tabelle C.1_Toxizität'!B8","v":102}]
["<=0,5","---","---","DGRL trifft nicht zu","<=0,5",null,null,"DGRL trifft nicht zu","Selbstzündungstemp.",{"$f":"'Tabelle C.1_Toxizität'!B9","v":743},"°C"]
[">0,5","<=25","---","Art.4 Abs.3",">0,5","<=32",null,"Art. 4 Abs. 3"]
[">0,5",">25<=100","<=1000","Kat. I",">0,5",">32","<=1000","Art. 4 Abs. 3"]
[">0,5",">25<=100",">1000","Kat. II",">0,5",">32<=100",">1000","Kat. I"]
[">0,5",">100<=3000","<=3500","Kat. II",">0,5",">100",">1000<=3500","Kat. I"]
[">0,5",">100<=3000",">3500","Kat. III",">0,5",">100<=250",">3500","Kat. II"]
[">0,5",">350",null,"Kat. III",">0,5",">250",">3500<=5000","Kat. II"]
[null,null,null,null,">0,5",">250",">5000","Kat. III"]

{"sheet":"Zugangsbereiche","index":12,"n_rows":7,"n_cols":3,"rows_kept":7,"cut":false,"hidden":false,"merged":[[0,0,0,2],[5,0,5,2],[6,0,6,2]]}
["Tabelle 4 — Kategorien der Zugangsbereiche"]
["Kategorien","Allgemeine Eigenschaften","Beispiele a"]
["Allgemeiner Zugangsbereich a","Räume, Gebäudeteile und Gebäude, in denen\n—    Schlafeinrichtungen vorhanden sind\n—    Personen in ihrer Bewegung eingeschränkt sind\n—    sich eine unkontrollierte Anzahl von\nPersonen aufhält\n—    jede Person Zutritt hat, ohne persönlich mit den erforderlichen Sicherheitsvorkehrungen vertraut zu sein","Krankenhäuser, Gerichtsgebäude oder Gefängnisse, Theater, Supermärkte, Schulen, Vortragsräume, Bahnhöfe, Hotels, Wohnungen, Restaurants"]
["Überwachter Zugangsbereich b","Räume, Gebäudeteile, Gebäude, in denen sich nur eine begrenzte Anzahl von Personen aufhalten darf, von denen einige mit den allgemeinen Sicherheitsvorkehrungen der Einrichtung vertraut sein müssen","Büro- oder Geschäftsräume, Laboratorien, Räume für allgemeine Fabrikations- und Arbeitszwecke"]
["Zugangsbereich, zu dem nur befugte Personen Zutritt haben c","Räume, Gebäudeteile, Gebäude, zu denen nur befugte Personen Zutritt haben, die mit den allgemeinen und besonderen Sicherheitsvorkehrungen der Einrichtung vertraut sind, und in denen Materialien oder Güter hergestellt, verarbeitet oder gelagert werden","Produktionseinrichtungen, z. B. für Chemikalien, Nahrungsmittel, Getränke, Industrie- und Speiseeis, Raffinerien, Kühlhallen, Molkereien, Schlachthöfe, nicht öffentliche Bereiche in Supermärkten"]
["a        Die Liste der Beispiele ist nicht vollständig."]
["ANMERKUNG       Zugangsbereiche können entsprechend den nationalen Anforderungen kategorisiert sein."]

{"sheet":"Aufstellungsort der Kälteanlage","index":13,"n_rows":10,"n_cols":4,"rows_kept":10,"cut":false,"hidden":false,"merged":[[0,0,0,3],[5,0,6,3]]}
[" Klassifikation der Aufstellungsorte von Kälteanlagen"]
[]
["Es bestehen vier Klassen von Aufstellungsorten für Kälteanlagen. Der geeignete Aufstellungsort ist nach"]
["dieser Europäischen Norm auszuwählen, welche mögliche Gefährdungen berücksichtigt."]
[]
["Die vier Klassen von Aufstellungsorten sind:"]
[]
["Klasse I","Klasse II","Klasse III","Klasse IV"]
["Mechanische Geräte im Personen-Aufenthaltsbereich","Verdichter im Maschinenraum oder im Freien","Maschinenraum oder im Freien","Belüftetes Gehäuse"]
[" Sofern die Kälteanlage oder die kältemittelführenden Teile sich im Personen-Aufenthaltsbereich befindet/befinden, gilt Klasse I, außer sie entspricht den Anforderungen der Klasse II.","Sofern sich alle Verdichter und Druckbehälter im Maschinenraum oder im Freien befinden, gelten die Anforderungen an einen Aufstellungsort der Klasse II, außer die Anlage entspricht den Anforderungen der Klasse III. Rohrschlangen und Rohrleitungen mit Ventilen dürfen sich in einem Personen-Aufenthaltsbereich befinden.","Sofern sich alle kältemittelführenden Teile in einem Maschinenraum oder im Freien befinden, gelten die Anforderungen an einen Aufstellungsort der Klasse III. Der Maschinenraum muss die Anforderungen nach EN 378-3 erfüllen.","Sofern sich alle kältemittelführenden Teile in einem belüfteten Gehäuse befinden, gelten die Anforderungen an einen Aufstellungsort der Klasse IV. Das belüftete Gehäuse muss die Anforderungen nach EN 378-2 und EN 378-3 erfüllen."]

{"sheet":"Kältemitteltabelle","index":14,"n_rows":170,"n_cols":9,"rows_kept":170,"cut":false,"hidden":false,"merged":[]}
["Kältemittel-nummer","Sicherheitsklasse","Brennbarkeit","Fluidgruppe PEDm","Praktischer Grenzwertd [kg/m³]","ATEL/ODLg [kg/m³]","LFLh [kg/m³]","Mole-kular-massea","Selbstentzündungs-temperatur °C"]
[]
[11,25,1,2,0.3,6.1999999999999998E-3,"NF",137.4,"ND"]
[12,"A",1,2,0.5,8.7999999999999995E-2,"NF",120.9,"ND"]
[13,"A",1,2,0.5,"ND","NF",104.5,"ND"]
[14,"A",1,2,0.4,0.4,"NF",88,"ND"]
[22,"A",1,2,0.3,0.21,"NF",86.5,635]
[23,"A",1,2,0.68,0.15,"NF",70,765]
[30,"B",2,2,1.7000000000000001E-2,"ND",0.41699999999999998,84.9,662]
[32,"A","2L",1,6.0999999999999999E-2,0.3,0.307,52,648]
[50,"A",3,1,6.0000000000000001E-3,"ND",3.2000000000000001E-2,16,645]
[113,"A",1,2,0.4,0.02,"NF",187.4,"ND"]
[114,"A",1,2,0.7,0.14000000000000001,"NF",170.9,"ND"]
[115,"A",1,2,0.76,0.76,"NF",154.5,"ND"]
[116,"A",1,2,0.68,0.68,"NF",138,"ND"]
[123,"B",1,2,0.1,5.7000000000000002E-2,"NF",153,730]
[124,"A",1,2,0.11,5.6000000000000001E-2,"NF",136.5,"ND"]
[125,"A",1,2,0.39,0.37,"NF",120,733]
[170,"A",3,1,8.6E-3,8.6E-3,3.7999999999999999E-2,30,515]
[218,"A",1,2,1.84E-2,0.85,"NF",188,"ND"]
[290,"A",3,1,8.0000000000000002E-3,0.09,3.7999999999999999E-2,44,470]
[500,"A",1,2,0.4,0.12,"NF",99.3,"ND"]
[501,"A",1,2,0.38,0.21,"NF",93.1,"ND"]
[502,"A",1,2,0.45,0.33,"NF",112,"ND"]
[503,"A",1,2,0.35,"ND","NF",87.5,"ND"]
[504,"A",1,2,0.45,0.45,"NF",79.2,"ND"]
[600,"A",3,1,8.8999999999999999E-3,2.3999999999999998E-3,3.7999999999999999E-2,58.1,365]
[601,"A",3,1,8.0000000000000002E-3,2.8999999999999998E-3,3.5000000000000003E-2,72.099999999999994,"ND"]
[717,"B","2L",1,3.5E-4,2.2000000000000001E-4,0.11600000000000001,17,630]
[744,"A",1,2,0.1,7.1999999999999995E-2,"NF",44,"ND"]
[1150,"A",3,1,6.0000000000000001E-3,"ND",3.5999999999999997E-2,28.1,"ND"]
[1270,"A",3,1,8.0000000000000002E-3,1.6999999999999999E-3,4.5999999999999999E-2,42.1,455]
["1130(E)\nButen-Reihe","B",2,1,4.0000000000000001E-3,4.0000000000000001E-3,0.25700000000000001,96.9,"ND"]
["1233zd(E)","A",1,2,8.5999999999999993E-2,8.5999999999999993E-2,"NF",130.5,"ND"]
["1234yf","A","2L",1,5.8000000000000003E-2,0.47,0.28899999999999998,114,405]
["1234ze(E)","A","2L","2n",6.0999999999999999E-2,0.28000000000000003,0.30299999999999999,114,368]
["12B1","ND","ND","ND",0.2,"ND","NF",165.4,"ND"]
["1336mzz(E)","A",1,2,4.8000000000000001E-2,4.8000000000000001E-2,"NF",164.1,"ND"]
["1336mzz(Z)","A",1,2,8.6999999999999994E-2,8.6999999999999994E-2,"NF",164.1,"ND"]
["134a","A",1,2,0.25,0.21,"NF",102,743]
["13B1","A",1,2,0.6,"ND","NF",148.9,"ND"]
["141b","ND","ND",2,5.2999999999999999E-2,1.2E-2,"NA",117,532]
["142b","A",2,1,6.6000000000000003E-2,0.1,0.32900000000000001,100.5,750]
["143a","A","2L",1,5.6000000000000001E-2,0.57999999999999996,0.28199999999999997,84,750]
["152a","A",2,1,2.7E-2,0.14000000000000001,0.13,66,455]
["227ea","A",1,2,0.63,0.63,"NF",170,"ND"]
["236fa","A",1,2,0.59,0.34,"NF",152,"ND"]
["245fa","B",1,2,0.19,0.19,"NF",134,"ND"]
["401A","A",1,2,0.3,0.1,"NF",94.4,681]
["401B","A",1,2,0.34,0.11,"NF",92.8,685]
["401C","A",1,2,0.24,8.3000000000000004E-2,"NF",10.1,"ND"]
["402A","A",1,2,0.33,0.27,"NF",101.5,723]
["402B","A",1,2,0.32,0.24,"NF",94.7,641]
["403A","A",1,2,0.33,0.24,0.48,9.1999999999999993,"ND"]
["403B","A",1,2,0.41,0.28999999999999998,"NF",103.3,"ND"]
["404A","A","A",2,0.52,0.52,"NF",97.6,728]
["405A","A",1,2,"ND",0.26,"ND",111.9,"ND"]
["406A","A",2,1,0.13,0.14000000000000001,0.30199999999999999,89.9,"ND"]
["407A","A",1,2,0.33,0.31,"NF",90.1,685]
["407B","A",1,2,0.35,0.33,"NF",102.9,703]
["407C","A",1,2,0.31,0.28999999999999998,"NF",86.2,704]
["407D","A",1,2,0.41,0.25,"NF",90.9,"ND"]
["407E","A",1,2,0.4,0.27,"NF",83.8,"ND"]
["407F","A",1,2,0.32,0.32,"NF",82.1,"ND"]
["407G","A",1,2,0.21,0.21,"NF",100,"ND"]
["407H","A",1,2,0.38,0.38,"NF",79.099999999999994,"ND"]
["407I","A",1,2,0.25,0.25,"NF",86.9,"ND"]
["408A","A",1,2,0.41,0.33,"NF",87,"ND"]
["409A","A",1,2,0.16,0.12,"NF",97.5,"ND"]
["409B","A",1,2,0.17,0.12,"NF",96.7,"ND"]
["410A","A",1,2,0.44,0.42,"NF",72.599999999999994,"ND"]
["410B","A",1,2,0.43,0.43,"NF",75.5,"ND"]
["411A","A",2,1,0.04,7.3999999999999996E-2,0.186,82.4,"ND"]
["411B","A",2,1,0.05,4.3999999999999997E-2,0.23899999999999999,83.1,"ND"]
["412A","A",2,1,7.0000000000000007E-2,0.17,0.32900000000000001,92.2,"ND"]
["413A","A",2,1,0.08,0.21,0.375,103.9,"ND"]
["414A","A",1,2,0.1,0.1,"NF",97,"ND"]
["414B","A",1,2,9.6000000000000002E-2,9.6000000000000002E-2,"NF",101.6,"ND"]
["415A","A",2,1,0.04,0.19,0.188,81.900000000000006,"ND"]
["415B","A",2,1,0.03,0.15,0.13,70.2,"ND"]
["416A","A",1,2,0.64,6.4000000000000001E-2,"NF",111.9,"ND"]
["417A","A",1,2,0.15,5.7000000000000002E-2,"NF",106.7,"ND"]
["417B","A",1,2,0.69,0.69,"NF",113.1,"ND"]
["417C","A",1,2,0.87,0.87,"NF",103.7,"ND"]
["418A","A",2,1,0.06,0.2,0.31,84.6,"ND"]
["419A","A",2,1,0.05,0.31,0.25,109.3,"ND"]
["419B","A",2,1,0.06,0.26,0.28999999999999998,105.2,"ND"]
["420A","A",1,2,0.18,0.18,"NF",101.9,"ND"]
["421A","A",1,2,0.28000000000000003,0.28000000000000003,"NF",111.8,"ND"]
["421B","A",1,2,0.33,0.33,"NF",116.9,"ND"]
["422A","A",1,2,0.28999999999999998,0.28999999999999998,"NF",113.6,"ND"]
["422B","A",1,2,0.25,0.25,"NF",108.5,"ND"]
["422C","A",1,2,0.28999999999999998,0.28999999999999998,"NF",113.4,"ND"]
["422D","A",1,2,0.26,0.26,"NF",109.9,"ND"]
["422E","A",1,2,0.26,0.26,"NF",109.3,"ND"]
["423A","A",1,2,0.3,0.3,"NF",126,"ND"]
["424A","A",1,2,0.1,0.1,"NF",108.4,"ND"]
["425A","A",1,2,0.27,0.27,"NF",90.3,"ND"]
["426A","A",1,2,8.3000000000000004E-2,8.3000000000000004E-2,"NF",101.6,"ND"]
["427A","A",1,2,0.28999999999999998,0.28999999999999998,"NF",90.4,"ND"]
["427B","A",1,2,0.35,0.35,"NF",85,"ND"]
["428A","A",1,2,0.37,0.37,"NF",107.5,"ND"]
["429A","A",3,1,0.01,9.8000000000000004E-2,5.1999999999999998E-2,50.8,"ND"]
["430A","A",3,1,1.7000000000000001E-2,0.1,8.4000000000000005E-2,64,"ND"]
["431A","A",3,1,0.09,0.1,4.3999999999999997E-2,48.8,"ND"]
["432A","A",3,1,8.0000000000000002E-3,2.0999999999999999E-3,3.9E-2,42.8,"ND"]
["433A","A",3,1,7.0000000000000001E-3,5.4999999999999997E-3,3.5999999999999997E-2,43.5,"ND"]
["433B","A",3,1,5.0000000000000001E-3,2.5000000000000001E-2,2.5000000000000001E-2,44,"ND"]
["433C","A",3,1,6.0000000000000001E-3,6.6E-3,3.2000000000000001E-2,43.6,"ND"]
["434A","A",1,2,0.32,0.32,"NF",105.7,"ND"]
["435A","A",3,1,1.4E-2,0.09,6.9000000000000006E-2,49,"ND"]
["436A","A",3,1,6.0000000000000001E-3,7.2999999999999995E-2,3.2000000000000001E-2,49.3,"ND"]
["436B","A",3,1,7.0000000000000001E-3,7.0999999999999994E-2,3.3000000000000002E-2,49.9,"ND"]
["436C","A",3,1,7.0000000000000001E-3,8.6999999999999994E-2,3.2000000000000001E-2,44.6,"ND"]
["437A","A",1,2,8.1000000000000003E-2,8.1000000000000003E-2,"NF",1037.0999999999999,"ND"]
["438A","A",1,2,7.9000000000000001E-2,7.9000000000000001E-2,"NF",99.1,"ND"]
["439A","A",2,1,6.0999999999999999E-2,0.34,0.30399999999999999,71.2,"ND"]
["440A","A",2,1,2.5000000000000001E-2,0.14000000000000001,0.124,66.2,"ND"]
["441A","A",3,1,6.3E-3,"0,006 3",3.2000000000000001E-2,48.3,"ND"]
["442A","A",1,2,0.33,0.33,"NF",81.8,"ND"]
["443A","A",3,1,3.0000000000000001E-3,3.0000000000000001E-3,3.5999999999999997E-2,43.5,"ND"]
["444A","A","2L",1,6.5000000000000002E-2,0.28899999999999998,0.32300000000000001,96.7,"ND"]
["444B","A","2L",1,5.5E-2,0.33,0.27600000000000002,72.8,"ND"]
["445A","A","2L",1,6.8999999999999992E-2,0.22799999999999998,0.34700000000000003,103.1,"ND"]
["446A","A","2L",1,4.7E-2,6.8000000000000005E-2,0.23700000000000002,62,"ND"]
["447A","A","2L",1,6.6000000000000003E-2,3.5999999999999997E-2,0.32999999999999996,63,"ND"]
["447B","A","2L",1,6.2E-2,3.5999999999999997E-2,0.312,63.1,"ND"]
["448A","A",1,2,0.38800000000000001,0.38800000000000001,"NF",86.3,"ND"]
["449A","A",1,2,0.35699999999999998,0.35699999999999998,"NF",87.2,"ND"]
["449B","A",1,2,0.35299999999999998,0.35299999999999998,"NF",86.4,"ND"]
["449C","A",1,2,0.36199999999999999,0.36199999999999999,"NF",90.3,"ND"]
["450A","A",1,2,0.32,0.32,"NF",108.7,"ND"]
["451A","A","2L",1,6.8000000000000005E-2,0.46200000000000002,0.34599999999999997,112.7,"ND"]
["451B","A","2L",1,6.8000000000000005E-2,0.46100000000000002,0.34100000000000003,112.6,"ND"]
["452A","A",1,2,0.42300000000000004,0.42300000000000004,"NF",103.5,"ND"]
["452B","A","2L",1,6.2E-2,0.36399999999999999,0.31,63.5,"ND"]
["452C","A",1,2,0.41699999999999998,0.41699999999999998,"NF",101.9,"ND"]
["453A","A",1,2,0.123,0.123,"NF",88.8,"ND"]
["454A","A","2L",1,5.6000000000000008E-2,0.46100000000000002,0.27799999999999997,80.5,"ND"]
["454B","A","2L",1,5.8999999999999997E-2,0.35799999999999998,0.29700000000000004,62.6,"ND"]
["454C","A","2L",1,5.8999999999999997E-2,0.44500000000000001,0.29300000000000004,90.8,"ND"]
["455A","A","2L",1,8.5999999999999993E-2,0.42899999999999999,0.43099999999999994,87.5,"ND"]
["456A","A","A1",2,0.31900000000000001,0.31900000000000001,"NF",101.4,"ND"]
["457A","A",1,1,4.2999999999999997E-2,0.39400000000000002,0.21600000000000003,87.6,"ND"]
["458A","A1",1,2,0.27599999999999997,0.27900000000000003,"NF",89.9,"ND"]
["459A","A","2L",1,5.6000000000000008E-2,0.46799999999999997,0.27799999999999997,63,"ND"]
["459B","A","2L",1,6.8000000000000005E-2,0.49000000000000005,0.34199999999999997,91.2,"ND"]
["460A","A",1,2,0.38200000000000001,0.38200000000000001,"NF",100.6,"ND"]
["460B","A",1,2,0.42000000000000004,0.42000000000000004,"NF",84.8,"ND"]
["460C","A",1,2,0.314,0.314,"NF",105.3,"ND"]
["461A","A",1,2,0.27400000000000002,0.27400000000000002,"NF",109.6,"ND"]
["462A","A",2,1,4.3999999999999997E-2,4.3999999999999997E-2,0.29100000000000004,67.8,"ND"]
["463A","A",1,2,3.0000000000000001E-3,3.0000000000000001E-3,"NF",74.7,"ND"]
["464A","A",1,2,0.43499999999999994,0.43499999999999994,"NF",88.5,"ND"]
["465A","A",2,1,3.2000000000000001E-2,0.40700000000000003,0.161,83.6,"ND"]
["507A","A",1,2,5.3000000000000005E-2,0.53,"NF",98.9,"ND"]
["508A","A",1,2,2.3E-2,2.3E-2,"NF",100.1,"ND"]
["508B","A",1,2,2.5000000000000001E-2,2E-3,"NF",95.4,"ND"]
["509A","A",1,2,0.56000000000000005,3.7999999999999999E-2,"NF",124,"ND"]
["510A","A",3,1,1.0999999999999999E-2,8.6999999999999994E-2,5.6000000000000008E-2,47.2,"ND"]
["511A","A",3,1,8.0000000000000002E-3,9.1999999999999998E-2,3.7999999999999999E-2,44.2,"ND"]
["512A","A",2,1,2.5000000000000001E-2,1.4000000000000002E-2,0.124,67.2,"ND"]
["513A","A",1,2,0.32900000000000001,0.32900000000000001,"NF",108.4,"ND"]
["513B","A",1,2,0.32900000000000001,0.32900000000000001,"NF",108.7,"ND"]
["514A","B",1,2,1.3000000000000001E-2,1.3000000000000001E-2,"NF",139.6,"ND"]
["515A","A",1,2,0.30599999999999999,0.30599999999999999,"NF",118.7,"ND"]
["600a","A",3,1,1.0999999999999999E-2,5.8999999999999997E-2,4.2999999999999997E-2,58.1,460]
["601a","A",3,1,8.0000000000000002E-3,2.8999999999999998E-3,3.7999999999999999E-2,72.099999999999994,"ND"]
["C318\nKohlen- wasserstoffe","A",1,2,8.1000000000000003E-2,6.5000000000000002E-2,"NF",200,"ND"]
["E170\nAnorga- nische Ver- bindungen","A",3,1,1.2999999999999999E-2,7.9000000000000001E-2,6.4000000000000001E-2,4.5999999999999996,235]

{"sheet":"Kältemittelbezeichnung","index":15,"n_rows":70,"n_cols":15,"rows_kept":70,"cut":false,"hidden":false,"merged":[]}
["Kältemittel-nummer","Chemische Bezeichnungb","Chemische Formel","Sicherheitsklasse","Fluidgruppe PEDm","Praktischer Grenzwertd [kg/m³]","ATEL/ODLg [kg/m³]","LFLh [kg/m³]","Dampfdichte 25°C, 101,2 kPaa [kg/m³]","Mole-kular-massea","Nor-maler Siede-punkta °C","ODPa,e","GWPl     100-J-ITH","GWAa,f (AR5)   100J-ITH","Selbstentzündungs-temperatur °C"]
["Methan- Reihe"]
[11,"Trichlorfluormethan","CCI3F","A1",2,"0,3i","0,006 2j","NF",562,1374,24,1,"4 750","4 660","ND"]
[12,"Dichlordifluormethan","CCI2F2","A1",2,"0,5i","0,088j","NF",494,1209,"−29",1,"10 900","10 200","ND"]
["12B1","Bromchlordifluormethan","CBrClF2","ND","ND",2,"ND","NF",676,1654,"−4",3,"1 890","1 750","ND"]
[13,"Chlortrifluormethan","CCIF3","A1",2,"0,5i","ND","NF",427,1045,"−81",1,"14 400","13 900","ND"]
["13B1","Bromtrifluormethan","CBrF3","A1",2,"0,6i","ND","NF",609,1489,"−58",10,"7 140","6 290","ND"]
[14,"Tetrafluorkohlenstoff","CF4","A1",2,4,"0,40j","NF",360,880,"−128",0,"7 390","6 630","ND"]
[22,"Chlordifluormethan","CHCIF2","A1",2,"0,3i","0,21j","NF",354,865,"−41",55,"1 810","1 760",635]
[23,"Trifluormethan","CHF3","A1",2,"0,68i",15,"NF",286,700,"−82",0,"14 800","12 400",765]
[30,"Dichlormethan\n(Methylenchlorid)","CH2Cl2","B2",2,17,"ND",417,"NA",849,40,"ND",9,9,662]
[32,"Difluormethan\n(Methylenfluorid)","CH2F2","A2L",1,61,"0,30j",307,213,520,"−52",0,675,677,648]
[50,"Methan","CH4","A3",1,6,"ND",32,654,160,"−161",0,25,30,645]
["Ethan-Reihe"]
[113,"1,1,2-Trichlor-1,2,2- trifluorethan","CCl2FCClF2","A1",2,"0,4i","0,02j","NF","NA",1874,48,8,"6 130","5 820","ND"]
[114,"1,2-Dichlor-1,1,2,2- tetrafluorethan","CClF2CClF2","A1",2,"0,7i","0,14j","NF",699,1709,4,1,"10 000","8 590","ND"]
[115,"Chlorpentafluorethan","CCIF2CF3","A1",2,"0,76i","0,76j","NF",632,1545,"−39",6,"7 370","7 670","ND"]
[116,"Hexafluorethan","CF3CF3","A1",2,68,68,"NF",564,1380,"−78",0,"12 200","11 100","ND"]
[123,"2,2-Dichlor-1,1,1- trifluorethan","CHCI2CF3","B1",2,"0,1i","0,057j","NF","NA",1530,27,2,77,79,730]
[124,"2-Chlor-1,1,1,2- tetrafluorethan","CHCIFCF3","A1",2,"0,11i","0,056j","NF",558,1365,"−12",22,609,527,"ND"]
[125,"Pentafluorethan","CHF2CF3","A1",2,"0,39i",37,"NF",491,1200,"−49",0,"3 500","3 170",733]
["134a","1,1,1,2-Tetrafluorethan","CH2FCF3","A1",2,"0,25i","0,21j","NF",417,1020,"−26",0,"1 430","1 300",743]
["141b","1,1-Dichlor-1-fluorethan","CH3CCI2F","ND",2,53,"0,012j","NA","NA",1170,32,11,725,782,532]
["142b","1-Chlor-1,1-difluorethan","CH3CCIF2","A2",1,66,"0,10j",329,411,1005,"−10",65,"2 310","1 980",750]
["143a","1,1,1-Trifluorethan","CH3CF3","A2L",1,56,"0,58j",282,344,840,"−47",0,"4 470","4 800",750]
["152a","1,1-Difluorethan","CH3CHF2","A2",1,"0,027i",14,130,270,660,"−25",0,124,138,455]
[170,"Ethan","CH3CH3","A3",1,"0,008 6","0,008 6j",38,123,300,"−89",0,6,6,515]
[1150,"Ethen (Ethylen)","CH2 = CH2","A3",1,6,"ND",36,115,281,"−104",0,4,4,"ND"]
["Propan-Reihe"]
[218,"Octafluorpropan","CF3CF2CF3","A1",2,184,"0,85j","NF",769,1880,"−37",0,"8 830","8 900","ND"]
["227ea","1,1,1,2,3,3,3- Heptafluorpropan","CF3CHFCF3","A1",2,63,"0,63j","NF",695,1700,"−15",0,"3 220","3 350","ND"]
["236fa","1,1,1,3,3,3-Hexafluorpropan","CF3CH2CF3","A1",2,"0,59 i","0,34j","NF",622,1520,"−1",0,"9 810","8 060","ND"]
["245fa","1,1,1,3,3-Pentafluorpropan","CF3CH2CHF2","B1",2,19,19,"NF",548,1340,15,0,"1 030",858,"ND"]
[290,"Propan","CH3CH2CH3","A3",1,8,9,38,180,440,"−42",0,3,3,470]
["1233zd(E)","Trans-1-chlor-3,3,3- trifluorprop-1-en","CF3CH = CHCl","A1",2,86,86,"NF",534,1305,181,"∼0",45,1,"ND"]
["1234yf","2,3,3,3-Tetrafluorprop-1-en","CF3CF = CH2","A2L",1,58,"0,47j",289,466,1140,"−29,5",0,4,"< 1",405]
["1234ze(E)","Trans-1,3,3,3- tetrafluorprop-1-en","CF3CF = CHF","A2L","2n",61,28,303,466,1140,"−19",0,7,"< 1",368]
[1270,"Propen (Propylen)","CH3CH = CH2","A3",1,"0,008i","0,001 7j k",46,172,421,"−48",0,2,2,455]
["Ethen-Reihe"]
["1130(E)\nButen-Reihe","Trans-1,2-dichlorethen","CHCl = CHCl","B2",1,4,4,257,"NA",969,477,"~0",0,"ND","ND"]
["1336mzz(E)","(E)-1,1,1,4,4,4-Hexafluor-2- buten","CF3CH =\nCHCF3","A1",2,48,48,"NF",693,1641,74,0,9,9,"ND"]
["1336mzz(Z)","Cis-1,1,1,4,4,4-hexafluor-2- buten","CF3CH =\nCHCF3","A1",2,87,87,"NF","NA",1641,334,0,9,2,"ND"]
["Zyklische organische Verbindungen"]
["C318\nKohlen- wasserstoffe","Octafluorcyclobutan","C4F8","A1",2,81,65,"NF",818,2000,"−6",0,"10 300","9 540","ND"]
[600,"Butan","CH3CH2CH2CH3","A3",1,"0,008 9i","0,002 4j k",38,238,581,0,0,4,4,365]
["600a","2-Methylpropan (Isobutan)","CH(CH3)3","A3",1,"0,011i",59,43,238,581,"−12",0,3,3,460]
[601,"Pentan","CH3CH2CH2CH2\nCH3","A3",1,"i","j k",35,"NA",721,36,0,5,5,"ND"]
["601a","2-Methylbutan (Isopentan)","(CH3)2CHCH2C H3","A3",1,"0,008i","0,002 9j k",38,"NA",721,27,0,5,5,"ND"]
["Andere organische Verbindungen"]
["E170\nAnorga- nische Ver- bindungen","Dimethylether","(CH3)2O","A3",1,"0,013i",79,64,188,46,"−25",0,1,1,235]
[717,"Ammoniak","NH3","B2L",1,"0,000 35i","0,000 22j",116,70,170,"−33",0,0,0,630]
[744,"Kohlendioxid","CO2","A1",2,"0,1i","0,072j","NF",180,440,"−78 c",0,1,1,"ND"]
[]
["Siehe Tabelle E.2 und Tabelle E.3 für R-400- und R-500-Gemische."]
["NA steht für „nicht anwendbar“ (en: not applicable). ND steht für „nicht bestimmt“ (en: not determined). NF steht für „nicht brennbar“ (en: non-flammable)."]
["a        Die Dampfdichte, die Molekularmasse, der normale Siedepunkt, ODP und GWP (AR5) fallen nicht in den Anwendungsbereich dieser Europäischen Norm und sind nur zur Information angegeben."]
["b       Nach der bevorzugten chemischen Benennung steht die umgangssprachliche Benennung in Klammern."]
["c        Sublimationstemperatur. Der Tripelpunkt liegt bei −56,6 °C und 5,2 bar."]
["d       Bestimmung nach 5.2 dieser Norm."]
["e        Annahme nach dem Montrealer Protokoll."]
["f        Daten aus IPCC-Beurteilungsbericht V (AR5); für nicht in AR5 enthaltene KWs, Daten aus F-Gas-Verordnung Nr. 517/2014."]
["g        Expositionsgrenzwert für die akute Toxizität (ATEL) oder Grenzwert für Sauerstoffmangel (ODL), es gilt der jeweils kleinere Wert. Werte aus ISO 817."]
["h       Untere Explosionsgrenze."]
["i         Die praktischen Grenzwerte beruhen auf Erfahrungswerten („Grandfathered values“) nach 5.2."]
["j         ATEL/ODL-Werte sind gegenüber EN 378-1:2008+A2:2012 geändert; nach Daten aus ISO 817."]
["k       Kein kardialer NOEL-Wert verfügbar, Wert nach ISO 817 bestimmt."]
["l         Daten  aus  Europäischer  F-Gas-Verordnung  Nr. 517/2014;  für  nicht  in  der  F-Gas-Verordnung  Nr. 517/2014  aufgeführte  FCKWs  und  HFCKWs  stammen  die  Daten  aus  dem"]
["IPCC-Beurteilungsbericht IV."]
["m      PED = Druckgeräterichtlinie (en: Pressure Equipment Directive) 2014/68/EU."]
["n       Nach den Prüfbedingungen in ISO 817 ist das Kältemittel der Klasse 2L zugeordnet, wobei das PED-Fluid entsprechend der CLP-Verordnung (EG) 1272/2008 der Gruppe 2 entspricht."]

{"sheet":"Kältemittel-Gemische R-400","index":16,"n_rows":128,"n_cols":15,"rows_kept":128,"cut":false,"hidden":false,"merged":[]}
["Kältemittel-nummer","Zusammensetzungc  Gewicht in %","Zusammensetzung Grenzabweichung  %","Sicherheitsklasse","Fluidgruppe PEDm","Praktischer Grenzwertd [kg/m³]","ATEL/ODLg [kg/m³]","LFLh [kg/m³]","Dampfdichte 25°C, 101,2 kPaa [kg/m³]","Mole-kular-massea","Normaler Siede-punkta °C","ODPa,e","GWPl     100-J-ITH","GWAa,f (AR5)   100J-ITH","Selbstentzündungs-temperatur °C"]
["401A","R-22/152a/124 (53/13/34)","±2/ +0,5 − 1,5/ ±1","A1",2,"0,30i","0,10j","NF",386,944,"−33,4 bis −27,8",37,"1 182","1 130",681]
["401B","R-22/152a/124 (61/11/28)","±2/ +0,5 − 1,5/ ±1","A1",2,"0,34i",11,"NF",380,928,"−34,9 bis −29,6",4,"1 288","1 240",685]
["401C","R-22/152a/124 (33/15/52)","±2/ +0,5 − 1,5/\n±1","A1",2,"0,24i","0,083j","NF",413,101,"−28,9 bis −23,3",3,9326,876,"ND"]
["402A","R-125/290/22 (60/2/38)","±2/ +0,1 − 1,0/\n±2","A1",2,"0,33i","0,27j","NF",416,1015,"−49,2 bis −47,0",21,"2 788","2 570",723]
["402B","R-125/290/22 (38/2/60)","±2/ +0,1 − 1,0/\n±2","A1",2,"0,32i","0,24j","NF",387,947,"−47,2 bis −44,8",33,"2 416","2 260",641]
["403A","R-290/22/218 (5/75/20)","+0,2 − 2,0/ ±2/\n±2","A1",2,"0,33i","0,24j",480,376,92,"−43,8 bis −42,3",41,"3 124","3 100","ND"]
["403B","R-290/22/218 (5/56/39)","+0,2 − 2,0/ ±2/\n±2","A1",2,"0,41i",29,"NF",422,1033,"−49,1 bis −46,84",31,"4 457","4 460","ND"]
["404A","R-125/143a/134a (44/52/4)","±2/ ±1/ ±2","A1",2,52,"0,52j","NF",399,976,"−46,5 bis −45,7",0,"3 922","3 940",728]
["405A","R-22/152a/142b/C318 (45/7/5,5/42,5)","±2/ ±1/ ±1/\n±2b","A1",2,"ND",26,"ND",458,1119,"−32,8 bis −24,4",28,"5 328","4 970","ND"]
["406A","R-22/600a/142b (55/4/41)","±2/ ±1/ ±1","A2",1,13,14,302,368,899,"−32,7 bis −23,5",57,"1 943","1 780","ND"]
["407A","R-32/125/134a (20/40/40)","±2/ ±2/ ±2","A1",2,"0,33i","0,31j","NF",368,901,"−45,2 bis −38,7",0,"2 107","1 920",685]
["407B","R-32/125/134a (10/70/20)","±2/ ±2/ ±2","A1",2,"0,35i","0,33j","NF",421,1029,"−46,8 bis −42,4",0,"2 804","2 550",703]
["407C","R-32/125/134a (23/25/52)","±2/ ±2/ ±2","A1",2,"0,31i","0,29j","NF",353,862,"−43,8 bis −36,7",0,"1 774","1 620",704]
["407D","R-32/125/134a (15/15/70)","±2/ ±2/ ±2","A1",2,"0,41i","0,25j","NF",372,909,"−39,4 bis −32,7",0,"1 627","1 490","ND"]
["407E","R-32/125/134a (25/15/60)","±2/ ±2/ ±2","A1",2,"0,40i","0,27j","NF",343,838,"−42,8 bis −35,6",0,"1 552","1 420","ND"]
["407F","R-32/125/134a (30/30/40)","±2/ ±2/ ±2","A1",2,32,32,"NF",336,821,"−46,1 bis −39,7",0,"1 825","1 670","ND"]
["407G","R-32/125/134a (2,5/2,5/95,0)","±0,5/ ±0,5/\n±1,0","A1",2,21,21,"NF",42,1000,"−29,2 bis −27,2",0,"1 463","1 330","ND"]
["407H","R-32/125/134a (32,5/15/52,5)","±1,0/ ±1,0/\n±2,0","A1",2,38,38,"NF",328,791,"−44,7 bis −37,6",0,"1 495","1 380","ND"]
["407I","R-32/125/134a (19,5/8,5/72)","1,0 − 2,0/ +2,0\n−1,0/ ±2,0","A1",2,25,25,"NF",361,869,"−39,8 bis −33,0",0,"1 459","1 340","ND"]
["408A","R-125/143a/22 (7/46/47)","±2/ ±1/ ±2","A1",2,"0,41i","0,33j","NF",356,870,"−44,6 bis −44,1",2.5999999999999999E-2,"3 152","3 260","ND"]
["409A","R-22/124/142b (60/25/15)","±2/ ±2/ ±1","A1",2,"0,16i","0,12j","NF",398,975,"−34,7 bis −26,3",48,"1 585","1 480","ND"]
["409B","R-22/124/142b\n(65/25/10)","±2/ ±2/ ±1","A1",2,"0,17i","0,12j","NF",395,967,"−35,8 bis −28,2",48,"1 560","1 470","ND"]
["410A","R-32/125 (50/50)","+0,5 −1,5/ +1,5\n−0,5","A1",2,"0,44i","0,42j","NF",297,726,"−51,6 bis −51,5",0,"2 088","1 920","ND"]
["410B","R-32/125 (45/55)","±1/ ±1","A1",2,"0,43i","0,43j","NF",309,755,"−51,5 bis -51,4",0,"2 229","2 050","ND"]
["411A","R-1270/22/152a (1,5/87,5/11,0)","+0 −1/ +2 −0/\n+0 −1","A2",1,"0,04i","0,074j",186,337,824,"−39,6 bis −37,1",48,"1 597","1 560","ND"]
["411B","R-1270/22/152a (3/94/3)","+0 −1/ +2 −0/\n+0 −1","A2",1,5,"0,044 j",239,340,831,"−41,6 bis −40,2",52,"1 705","1 660","ND"]
["412A","R-22/218/142b (70/5/25)","±2/ ±2/ ±1","A2",1,7,"0,17j",329,377,922,"−36,5 bis −28,9",55,"2 286","2 170","ND"]
["413A","R-218/134a/600a (9/88/3)","±1/ ±2/ +0 −1","A2",1,8,21,375,425,1039,"−29,4 bis −27,4",0,"2 053","1 950","ND"]
["414A","R-22/124/600a/142b (51,0/28,5/4,0/16,5)","±2/ ±2/ ±0,5/\n+0,5 −1,0","A1",2,"0,10i","0,10j","NF",396,970,"−33,2 bis −24,7",45,"1 478","1 370","ND"]
["414B","R-22/124/600a/142b (50,0/39,0/1,5/9,5)","±2/ ±2/ ±0,5/\n+0,5 −1,0","A1",2,"0,096i","0,096j","NF",416,1016,"−33,1 bis −24,7",42,"1 362","1 270","ND"]
["415A","R-22/152a (82,0/18,0)","±0,1/ ±0,1","A2",1,4,"0,19j",188,335,819,"−37,5 bis -34,7",28,"1 507","1 470","ND"]
["415B","R-22/152a (25,0/75,0)","±0,1/ ±0,1","A2",1,3,"0,15j",13,287,702,"−23,4 bis −21,8",9,5455,544,"ND"]
["416A","R-134a/124/600 (59,0/39,5/1,5)","+0,5 −1,0/ +1,0\n−0,5/ +0,1 −0,2","A1",2,64,"0,064j","NF",458,1119,"−23,9 bis −22,1",9,"1 084",975,"ND"]
["417A","R-125/134a/600 (46,6/50,0/3,4)","±1,1/ ±1,0/\n+0,1 −0,4","A1",2,"0,15i","0,057j","NF",436,1067,"−38,0 bis −32,9",0,"2 346","2 130","ND"]
["417B","R-125/134a/600 (79,0/18,3/2,7)","±1,1/ ±1,0/\n+0,1 −0,5","A1",2,69,69,"NF",463,1131,"−44,9 bis −41,5",0,"3 027","2 740","ND"]
["417C","R-125/134a/600 (19,5/78,8/1,7)","±1,0/ ±1,0/\n+0,1 −0,5","A1",2,87,87,"NF",424,1037,"−32,7 bis −29,2",0,"1 809","1 640","ND"]
["418A","R-290/22/152a (1,5/96,0/2,5)","±0,5/ ±1,0/\n±0,5","A2",1,6,"0,20j",31,346,846,"−41,7 bis −40,0",33,"1 741","1 690","ND"]
["419A","R-125/134a/E170 (77,0/19,0/4,0)","±1,0/ ±1,0/\n±1,0","A2",1,5,"0,31j",25,447,1093,"−42,6 bis −35,9",0,"2 967","2 690","ND"]
["419B","R-125/134a/E170 (48,5/48,0/3,5)","±1,0/ ±1,0/\n±0,5","A2",1,6,26,29,43,1052,"−37,4 bis −31,5",0,"2 384","2 160","ND"]
["420A","R-134a/142b (88,0/12,0)","+1,0 −1,0/ +0,0\n−1,0","A1",2,18,"0,18j","NF",416,1019,"−24,9 bis −24,2",5,"1 536","1 380","ND"]
["421A","R-125/134a (58,0/42,0)","±1,0/ ±1,0","A1",2,28,"0,28j","NF",457,1118,"−40,8 bis −35,5",0,"2 631","2 380","ND"]
["421B","R-125/134a (85,0/15,0)","±1,0/ ±1,0","A1",2,33,"0,330j","NF",478,1169,"−45,7 bis -432,6",0,"3 190","2 890","ND"]
["422A","R-125/134a/600a (85,1/11,5/3,4)","±1,0/ ±1,0/\n+0,1 −0,4","A1",2,29,"0,29j","NF",465,1136,"−46,5 bis −44,1",0,"3 143","2 850","ND"]
["422B","R-125/134a/600a (55,0/42,0/3,0)","±1,0/ ±1,0/\n+0,1 −0,5","A1",2,25,"0,25j","NF",444,1085,"−40,5 bis −35,6",0,"2 526","2 290","ND"]
["422C","R-125/134a/600a (82,0/15,0/3,0)","±1,0/ ±1,0/\n+0,1 −0,5","A1",2,29,"0,29j","NF",464,1134,"−45,3 bis −42,3",0,"3 085","2 790","ND"]
["422D","R-125/134a/600a (65,1/31,5/3,4)","+0,9 −1,1/\n±1,0/ +0,1 −0,4","A1",2,26,"0,26j","NF",449,1099,"−43,2 bis −38,4",0,"2 729","2 470","ND"]
["422E","R-125/134a/600a (58,0/39,3/2,7)","±1,0/ +1,7 −1,3/\n+0,3 −0,2","A1",2,26,26,"NF",447,1093,"−41,8 bis −36,4",0,"2 592","2 350","ND"]
["423A","R-134a/227ea (52,5/47,5)","±1,0/ ±1,0","A1",2,30,"0,30j","NF",515,1260,"−24,2 bis −23,5",0,"2 280","2 270","ND"]
["424A","R-125/134a/600a/600/601a (50,5/47,0/0,9/1,0/0,6)","±1,0/ ±1,0/\n+0,1 −0,2/ +0,1\n−0,2/ +0,1 −0,2","A1",2,10,"0,10j","NF",443,1084,"−39,1 bis −33,3",0,"2 440","2 210","ND"]
["425A","R-32/134a/227ea (18,5/69,5/12,0)","±0,5/ ±0,5/\n±0,5","A1",2,27,"0,27j","NF",369,903,"−38,1 bis −31,3",0,"1 505","1 430","ND"]
["426A","R-125/134a/600/601a (5,1/93,0/1,3/0,6)","±1,0/ ±1,0/\n+0,1 −0,2/ +0,1\n−0,2","A1",2,83,"0,083j","NF",416,1016,"−28,5 bis −26,7",0,"1 508","1 370","ND"]
["427A","R-32/125/143a/134a (15,0/25,0/10,0/50,0)","±2,0/ ±2,0/\n±2,0/ ±2,0","A1",2,29,"0,29j","NF",370,904,"−43,0 bis −36,3",0,"2 138","2 020","ND"]
["427B","R-32/125/143a/134a (20,6/25,6/19,0/34,8)","+1,0 −2,0/ +2,0\n−1,0/ ±2,0/ ±2,0","A1",2,35,35,"NF",353,850,"−46,2 bis −40,1",0,"2 382","2 320","ND"]
["428A","R-125/143a/290/600a (77,5/20,0/0,6/1,9)","±1,0/ ±1,0/\n+0,1 −0,2/ +0,1\n−0,2","A1",2,37,"0,37j","NF",440,1075,"−48,3 bis −47,5",0,"3 607","3 420","ND"]
["429A","R-E170/152a/600a (60,0/10,0/30,0)","±1,0/ ±1,0/\n±1,0","A3",1,1,"0,098j",52,208,508," −26,0 bis−25,6",0,19,153,"ND"]
["430A","R-152a/600a (76,0/24,0)","±1,0/ ±1,0","A3",1,17,"0,10j",84,261,640,"−27,6 bis −27,6",0,95,106,"ND"]
["431A","R-290/152a (71,0/29,0)","±1,0/ ±1,0","A3",1,9,"0,10j",44,200,488,"−43,1 bis -43,1",0,381,422,"ND"]
["432A","R-1270/E170 (80,0/20,0)","±1,0/ ±1,0","A3",1,8,"0,002 1j",39,175,428,"−46,6 bis −45,6",0,18,18,"ND"]
["433A","R-1270/290 (30,0/70,0)","±1,0/ ±1,0","A3",1,7,"0,005 5j",36,178,435,"−44,6 bis -44,2",0,27,27,"ND"]
["433B","R-1270/290 (5,0/95,0)","±1,0/ ±1,0","A3",1,5,25,25,18,440,"−42,7 bis −42,5",0,3,3,"ND"]
["433C","R-1270/290 (25,0/75,0)","±1,0/ ±1,0","A3",1,6,"0,006 6j",32,178,436,"−44,3 bis −43,9",0,28,28,"ND"]
["434A","R-125/143a/134a/600a (63,2/18,0/16,0/2,8)","±1,0/ ±1,0/\n±1,0/ +0,1 −0,2","A1",2,32,"0,32j","NF",432,1057,"−45,0 bis −42,3",0,"3 245","3 080","ND"]
["435A","R-E170/152a (80,0/20,0)","±1,0/ ±1,0","A3",1,14,"0,09j",69,200,490,"−26,1 bis −25,9",0,256,284,"ND"]
["436A","R-290/600a (56,0/44,0)","±1,0/ ±1,0","A3",1,6,"0,073j",32,202,493,"−34,3 bis −26,2",0,3,3,"ND"]
["436B","R-290/600a (52,0/48,0)","±1,0/ ±1,0","A3",1,7,"0,071j",33,200,499,"−33,4 bis −25,0",0,3,3,"ND"]
["436C","R-290/600a (95,0/5,0)","±2,0/ ±2,0","A3",1,7,87,32,185,446,"−41,5 bis −39,5",0,4,3,"ND"]
["437A","R-125/134a/600/601 (19,5/78,5/1,4/0,6)","+0,5 −1,8/ +1,5\n−0,7/ +0,1\n−0,2/ +0,1 −0,2","A1",2,81,"0,081j","NF",424,10371,"−32,9 bis −29,2",0,"1 805","1 640","ND"]
["438A","R-32/125/134a/600/\n601a\n(8,5/45,0/44,2/1,7/0,6)","+0,5 −1,5/\n±1,5/ ±1,5/\n+0,1 −0,2/ +0,1\n−0,2","A1",2,79,"0,079j","NF",405,991,"−43,0 bis −36,4",0,"2 265","2 060","ND"]
["439A","R-32/125/600a\n(50,0/47,0/3,0)","±1,0/ ±1,0/\n±0,5","A2",1,61,34,304,291,712,"−52,0 bis −51,8",0,"1 983","1 830","ND"]
["440A","R-290/134a/152a\n(0,6/1,6/97,8)","±0,1/ ±0,6/\n±0,5","A2",1,25,14,124,271,662,"−25,5 bis −24,3",0,1442,156,"ND"]
["441A","R-170/290/600a/600 (3,1/54,8/6,0/36,1)","±0,3/ ±2,0/\n±0,6/ ±2,0","A3",1,"0,006 3","0,006 3",32,198,483,"−41,9 bis −20,4",0,35,35,"ND"]
["442A","R-32/125/134a/152a/227ea (31,0/31,0/30,0/3,0/5,0)","±1,0/ ±1,0/\n±1,0/ ±0,5/\n±1,0","A1",2,33,33,"NF",335,818,"−46,5 bis −52,7",0,"1 888","1 750","ND"]
["443A","R-1270/290/600a (55/40/5)","±2,0/ ±2,0/\n±1,2","A3",1,3,3,36,18,435,"−44,8 bis −41,2",0,25,25,"ND"]
["444A","R-32/152a/1234ze(E) (12/5/83)","±1,0/ ±1,0/\n±2,0","A2L",1,65,289,323,403,967,"−34,3 bis −24,3",0,93,89,"ND"]
["444B","R-32/152a/1234ze(E) (41,5/10/48,5)","±1,0/ ±1,0/\n±1,0","A2L",1,55,33,276,302,728,"−44,6 bis −34,9",0,2959,295,"ND"]
["445A","R-744/134a/1234ze(E) (6/9/85)","±1,0/ ±1,0/\n±2,0","A2L",1,69,228,347,429,1031,"−50,3 bis −23,5",0,1347,118,"ND"]
["446A","R-32/1234ze(E)/600 (68/29/3)","+0,5 −1,0/ +2,0\n−0,6/ +1,0 −1,0","A2L",1,47,68,237,26,620,"−49,4 bis −44,0",0,4612,461,"ND"]
["447A","R-32/125/1234ze(E) (68/3,5/28,5)","+1,5 −0,5/ +1,5\n−0,5/ +1,0 −1,0","A2L",1,66,36,330,261,630,"−49,3 bis −44,2",0,5835,572,"ND"]
["447B","R-32/125/1234ze(E) (68/8/24)","+1,0 −2,0/ +2,0\n−1,0/ +1,0 −2,0","A2L",1,62,36,312,26,631,"−50,1 bis −46,0",0,7407,714,"ND"]
["448A","R-32/125/1234yf/134a/1234ze(E) (26/26/20/21/7)","+0,5 −2,0/ +2,0\n−0,5/ +0,5 −2,0/\n+2,0 −1,0/ +0,5\n−2,0","A1",2,388,388,"NF",358,863,"−45,9 bis −39,8",0,"1 387","1 270","ND"]
["449A","R-32/125/1234yf/134a (24,3/24,7/25,3/25,7)","+2,0 −1,0/ +1,0\n−0,2/ +0,2\n−1,0/ +1,0 −0,2","A1",2,357,357,"NF",362,872,"−46,0 bis −39,9",0,"1 397","1 280","ND"]
["449B","R-32/125/1234yf/134a (25,2/24,3/23,2/27,3)","+0,3 −1,5/ +1,5\n−0,3/ +0,3\n−1,5/ +1,5 −0,3","A1",2,353,353,"NF",359,864,"−46,1 bis −40,2",0,"1 412","1 300","ND"]
["449C","R-32/125/1234yf/134a\n(20/20/31/29)","+0,5 −1,5/ +1,5\n−0,5/ +0,5\n−1,5/ +1,5 −0,5","A1",2,362,362,"NF",376,903,"−44,6 bis −38,2",0,"1 251","1 150","ND"]
["450A","R-134a/1234ze(E) (42/58)","±2,0/ ±2,0","A1",2,320,320,"NF",454,1087,"−23,4 bis −22,8",0,6047,547,"ND"]
["451A","R-1234yf/134a\n(89,8/10,2)","±0,2/ ±0,2","A2L",1,68,462,346,471,1127,"−30,8 bis −30,5",0,1495,133,"ND"]
["451B","R-1234yf/134a\n(88,8/11,2)","±0,2/ ±0,2","A2L",1,68,461,341,470,1126,"−31,0 bis −30,6",0,1637,146,"ND"]
["452A","R-32/125/1234yf\n(11/59/30)","±1,7/ ±1,8","A1",2,423,423,"NF",430,1035,"−47 bis −43,2",0,"2 140","1 950","ND"]
["452B","R-32/125/1234yf\n(67/7/26)","±2,0/ ±1,5/\n±2,0","A2L",1,62,364,310,263,635,"−51,0 bis −50,3",0,6983,676,"ND"]
["452C","R-32/125/1234yf\n(12,5/61/26,5)","+0,5 −1,5/\n±1,0/ +0,5 −1,5","A1",2,417,417,"NF",423,1019,"−47,5 bis −44,2",0,"2 220","2 020","ND"]
["453A","R-32/125/134a/227ea/\n600/601a (20/20/53,8/\n5/0,6/0,6)","±1,0/ ±1,0/\n±1,0/ ±0,5/\n+0,1 −0,2/ +0,1\n−0,2","A1",2,123,123,"NF",369,888,"−42,2 bis −35,0",0,"1 765","1 640","ND"]
["454A","R-32/1234yf (35/65)","±2,0/ ±2,0","A2L",1,56,461,278,334,805,"−48,4 bis −41,6",0,2389,238,"ND"]
["454B","R-32/1234yf (68,9/31,1)","±1,0/ ±1,0","A2L",1,59,358,297,260,626,"−50,9 bis −50,0",0,4663,467,"ND"]
["454C","R-32/1234yf (21,5/78,5)","±2,0/ ±2,0","A2L",1,59,445,293,378,908,"−46,0 bis −37,8",0,1483,146,"ND"]
["455A","R-744/32/1234yf\n(3/21,5/75,5)","+2,0 −1,0/ +1,0\n−2,0/ ±2,0","A2L",1,86,429,431,364,875,"−51,6 bis −39,1",0,1482,146,"ND"]
["456A","R-32/134a/1234ze(E) (6/45/49)","±1,0/ ±1,0/\n±1,0","A1",2,319,319,"NF",423,1014,"−30,4 bis −25,6",0,6874,626,"ND"]
["457A","R-32/1234yf/152a\n(18/70/12)","+0,5 −1,5/ +0,5\n−1,5/ +0,1 −1,9","A2L",1,43,394,216,365,876,"−42,7 bis −35,5",0,1392,139,"ND"]
["458A","R-32/125/134a/227ea/\n236fa (20,5/4/61,4/13,5\n/0,6)","±0,5/ ±0,5/\n±0,5/ ±0,5/\n±0,1","A1",2,276,279,"NF",374,899,"−39,8 bis −32,4",0,"1 650","1 560","ND"]
["459A","R-32/1234yf/1234ze(E) (68,0/26,0/6,0)","+0,5 −1,5/\n±2,0/ +1,5 −0,5","A2L",1,56,468,278,261,630,"−50,3 bis −48,6",0,4605,461,"ND"]
["459B","R-32/1234yf/1234ze(E) (21,0/69,0/10,0)","+0,5 −1,0/\n±2,0/ ±1,0","A2L",1,68,490,342,379,912,"−44,0 bis −36,1",0,1452,143,"ND"]
["460A","R-\n32/125/134a/1234ze(E) (12,0/52,0/14,0/22,0)","±1,0/ ±1,0/\n±1,0/ ±1,0","A1",2,382,382,"NF",418,1006,"−44,6 bis −37,7",0,"2 103","1 910","ND"]
["460B","R-\n32/125/134a/1234ze(E) (28,0/25,0/20,0/27,0)","±1,0/ ±1,0/\n±1,0/ ±1,0","A1",2,420,420,"NF",352,848,"−45,2 bis −37,1",0,"1 352","1 240","ND"]
["460C","R-32/125/134a/1234ze( E)(2,5/2,5/46,0/49,0)","±0,5/ ±0,5/\n±1,0/ ±1,0","A1",2,314,314,"NF",440,1053,"−27,8 bis −24,5",0,7656,695,"ND"]
["461A","R-125/R-143a/134a/R-\n227ea/600a\n(55,0/5,0/32,0/5,0/3,0)","±1,0/ ±0,5/\n±1,0/ ±0,5/\n+0,1 −0,4","A1",2,274,274,"NF",456,1096,"−29,2 bis −26,0",0,"2 767","2 570","ND"]
["462A","R-32/125/143a/134a/6\n00 (9,0/42,0/2,0/44,0/3,0)","+1,5 −1,0/\n±2,0/ ±1,0/\n±2,0/ ±1,0","A2",1,44,44,291,404,678,"−42,0 bis −37,0",0,"2 249","2 060","ND"]
["463A","R-744/32/125/1234yf/1\n34a\n(6,0/36,0/30,0/14,0/14,\n0)","+2,0 −1,0/\n±2,0/ ±2,0/\n±2,0/ ±2,0","A1",2,3,3,"NF",404,747,"−42,6 bis −36,2",0,"1 494","1 380","ND"]
["464A","R-32/125/1234ze(E)/22\n7ea (27,0/27,0/40,0/6,0)","±1,0/ ±1,0/\n±1,0/ ± 0,5","A1",2,435,435,"NF",368,885,"−58,4 bis −46,9",0,"1 323","1 240","ND"]
["465A","R-32/290/1234yf (21,0/7,9/71,1)","+0,5 −1,5/ +0,1\n−0,9/ ±1,0","A2",1,32,407,161,345,836,"−46,5 bis −36,9",0,1448,143,"ND"]
["ND steht für „nicht bestimmt“ (en: not determined)."]
["NF steht für „nicht brennbar“ (en: non-flammable)."]
[]
["a        ODP, GWP (AR5), Dampfdichte, Molekularmasse, „Siedepunkt“- und „Taupunkt“-Temperaturen fallen nicht in den Anwendungsbereich dieser Norm; sie sind nur zur Information angegeben. Die „Siedepunkttemperatur“ ist die Sättigungstemperatur eines flüssigen Kältemittels bei dem festgelegten Druck, d. h. die Temperatur, bei der ein flüssiges Kältemittel zu"]
["sieden beginnt. Der Siedepunkt eines zeotropen Kältemittelgemischs bei konstantem Druck ist niedriger als der Taupunkt. Die „Verflüssigungstemperatur“ ist die Sättigungstemperatur"]
["eines dampfförmigen Kältemittels bei dem festgelegten Druck, d. h. die Temperatur, bei der der letzte Tropfen des flüssigen Kältemittels siedet. Der Taupunkt eines zeotropen"]
["Kältemittelgemischs bei konstantem Druck ist höher als der Siedepunkt."]
["b       Die Summe der Grenzabmaße für die Zusammensetzung der Kältemittel R-152a und R-142b muss zwischen +0 und −2 % liegen."]
["c        Die Mischungsbestandteile sind üblicherweise nach ansteigendem normalem Siedepunkt sortiert."]
["d       Praktischer Grenzwert. Errechnet aus den Werten für die Einzelbestandteile."]
["e        Ozonabbaupotential: Errechnet aus den Werten für die Einzelbestandteile nach Tabelle E.1."]
["f        Treibhauspotential: Errechnet aus den Werten für die Einzelbestandteile nach Tabelle E.1. GWP-Werte (AR5) werden auf drei Nachkommastellen gerundet."]
["g        Expositionsgrenzwert für die akute Toxizität (ATEL) oder Grenzwert für Sauerstoffmangel (ODL), es gilt der jeweils kleinere Wert."]
["h       Untere Explosionsgrenze, entsprechend WCF für als 2L klassifizierte Gemische."]
["i         Die praktischen Grenzwerte beruhen auf Erfahrungswerten („Grandfathered values“) nach 5.2."]
["j         ATEL/ODL-Werte sind gegenüber EN 378-1:2008+A2:2012 geändert; nach Daten aus ISO 817."]
["k       Daten aus Europäischer F-Gas-Verordnung Nr. 517/2014; für nicht in der F-Gas-Verordnung Nr. 517/2014 aufgeführte FCKWs und HFCKWs stammen die Daten aus dem IPCC-"]
["Beurteilungsbericht IV."]
["l         PED = Druckgeräterichtlinie (en: Pressure Equipment Directive) 2014/68/EU."]
["m      Daten aus IPCC-Beurteilungsbericht V (AR5); für nicht in AR5 enthaltene KWs, Daten aus F-Gas-Verordnung Nr. 517/2014."]

{"sheet":"Kältemittel-Gemische R-500","index":17,"n_rows":20,"n_cols":16,"rows_kept":20,"cut":false,"hidden":false,"merged":[[19,0,20,15]]}
["Kältemittel-nummer","Zusammensetzungc  Gewicht in %","Zusammensetzung Grenzabweichung  %","Sicherheitsklasse","Fluidgruppe PEDm","Praktischer Grenzwertd [kg/m³]","ATEL/ODLg [kg/m³]","LFLh [kg/m³]","Dampfdichte 25°C, 101,2 kPaa [kg/m³]","Mole-kular-massea","Normaler Siede-punkta °C","Azeotrope Temperaturd  °C","ODPa,e","GWPl     100-J-ITH","GWAa,f (AR5)   100J-ITH","Selbstentzündungs-temperatur °C"]
[500,"R-12/152a\n(73,8/26,2)","+1,0 − 0,0/ +0,0\n−1,0","A1",2,"0,4 i","0,12j","NF",406,993,"−33,5",0,74,"8 077","7 560","ND"]
[501,"R-22/12 (75,0/25,0)c",null,"A1",2,"0,38 i","0,21j","NF",381,931,"−41,0","−41",29,"4 083","3 870","ND"]
[502,"R-22/115 (48,8/51,2)",null,"A1",2,"0,45 i","0,33j","NF",456,1120,"−45,4",19,33,"4 657","4 790","ND"]
[503,"R-23/13 (40,1/59,9)",null,"A1",2,"0,35 i","ND","NF",358,875,"−88,7",88,6,"14 560","13 300","ND"]
[504,"R-32/115 (48,2/51,8)",null,"A1",2,45,45,"NF",324,792,"−57",17,31,"4 143","4 300","ND"]
["507A","R-125/143a\n(50/50)","+1,5 −0,5/ +0,5\n−1,5","A1",2,53,"0,53j","NF",404,989,"−46,7","−40",0,"3 985","3 990","ND"]
["508A","R-23/116 (39,0/61,0)","±2,0/ ±2,0","A1",2,23,23,"NF",409,1001,"−86,0","−86",0,"13 210","11 600","ND"]
["508B","R-23/116 (46,0/54,0)","±2,0/ ±2,0","A1",2,25,2,"NF",390,954,"−88,3","−45,6",0,"13 400","11 700","ND"]
["509A","R-22/218 (44,0/56,0)","±2,0/ ±2,0","A1",2,"0,56 i",38,"NF",507,1240,"−47,0",0,24,"5 741","5 760","ND"]
["510A","R-E170/600a\n(88,0/12,0)","±0,5/ ±0,5","A3",1,11,"0,087j",56,193,472,"−25,1","−25,2",0,12,12,"ND"]
["511A","R-290/E170 (95,0/5,0)","±1,0/ ±1,0","A3",1,8,92,38,181,442,"−42","−20 bis\n+40",0,29,29,"ND"]
["512A","R-134a/152a\n(5,0/95,0)","±1,0/ ±1,0","A2",1,25,14,124,275,672,"−24","−20 bis\n+40",0,1893,196,"ND"]
["513A","1234yf/134a\n(56/44)","+1,0/ −1,0,\n+1,0/ −1,0","A1",2,329,329,"NF",452,1084,"−29,1",27,0,6314,573,"ND"]
["513B","R-1234yf/134a\n(58,5/41,5)","±0,5/ ±0,5","A1",2,329,329,"NF",454,1087,"−29,2",272,0,5958,540,"ND"]
["514A","R-1336mzz(Z)/\n1130(E) (74,7/25,3)","+1,5 −0,5/ +0,5\n−1,5","B1",2,13,13,"NF","NA",1396,290,500,"~0",7,"ND","ND"]
["515A","R-\n1234ze(E)/227ea\n(88,0/12,0)","+1,0 −2,0/ +2,0\n−1,0","A1",2,306,306,"NF",497,1187,"−18,9",600,0,3926,403,"ND"]
["NA steht für „nicht anwendbar“ (en: not applicable). ND steht für „nicht bestimmt“ (en: not determined). NF steht für „nicht brennbar“ (en: non-flammable)."]
[]
["a          Bei  azeotropen  Kältemitteln  kommt  es  unter  anderen  Temperatur-  und  Druckbedingungen  als  bei  ihrer  ursprünglichen  Formulierung  zu  einer  leichten  Entmischung  ihrer\nBestandteile. Der Umfang dieser Entmischung ist vom jeweiligen Azeotrop und der Größe und Position der Anlagenkomponenten abhängig.\nb          ODP,  GWP  (AR5),  Dampfdichte,  Molekularmasse,  azeotrope  Temperatur  und  normaler  Siedepunkt  fallen  nicht  in  den  Anwendungsbereich  dieser  Norm  und  sind  nur  zu\nInformationszwecken angegeben.\nc          Die exakte Zusammensetzung dieses Azeotrops ist nicht eindeutig und es sind zusätzliche Untersuchungen erforderlich.\nd         Unter Dampf-Flüssigkeits-Gleichgewichtsbedingungen (VLE, en: Vapour-Liquid Equilibrium).\ne         Die Mischungsbestandteile sind üblicherweise nach ansteigendem normalem Siedepunkt sortiert.\nf          Ozonabbaupotential: Errechnet aus den Werten für die Einzelbestandteile nach Angabe in Tabelle E.1.\ng         Expositionsgrenzwert für die akute Toxizität (ATEL) oder Grenzwert für Sauerstoffmangel (ODL), es gilt der jeweils kleinere Wert.\nh         Untere Explosionsgrenze, entsprechend WCF für als 2L klassifizierte Gemische.\ni          Die praktischen Grenzwerte beruhen auf Erfahrungswerten („Grandfathered values“) nach 5.2.\nj          ATEL/ODL-Werte sind gegenüber EN 378-1:2008+A2:2012 geändert; nach Daten aus ISO 817.\nk         Treibhauspotential: Errechnet aus den Werten für die Einzelbestandteile nach Angabe in Tabelle E.1. GWP-Werte (AR5) werden auf drei Nachkommastellen gerundet.\nl          PED = Druckgeräterichtlinie (en: Pressure Equipment Directive) 2014/68/EU.\nm        Daten aus IPCC-Beurteilungsbericht V (AR5); für nicht in AR5 enthaltene KWs, Daten aus F-Gas-Verordnung Nr. 517/2014."]